program: Orca
programVersion: 4.2.1
elementType: S F F F O O O O O O O N N N N N C C C C C C C C C C C C C C C H H H H H H H H H H H H H H
charge: 0
multiplicity: 1
keywords: wb97x-d3
keywords: def2-TZVPP
keywords: def2/J RIJCOSX GRIDX6 NOFINALGRIDX
keywords: grid4 nofinalgrid
keywords: scfconv7
keywords: smallprint printgap noloewdin
keywords: NOSOSCF
formula: C15H14F3N5O7S
InChI: InChI=1S/C15H14F3N5O7S/c1-28-9-6-10(29-2)21-13(20-9)22-14(25)23-31(26,27)11-7(12(24)30-3)4-5-8(19-11)15(16,17)18/h4-6,22-23H,1-3H3
45 atoms
S  -1.802066 1.36203 -0.380431
F  0.95449 -2.803936 -1.799734
F  1.351898 -2.534541 0.2954
F  0.428704 -4.354005 -0.399652
O  -1.678065 1.808959 -1.751592
O  -2.808571 1.921923 0.493381
O  -5.181044 -0.467367 0.973378
O  -4.840546 0.406415 -1.063737
O  -0.79598 0.583279 2.259835
O  5.902818 0.962232 1.277272
O  3.202477 2.473813 -2.183767
N  -0.860746 -1.077903 -0.487863
N  -0.296057 1.562873 0.270102
N  1.375519 0.948437 1.761942
N  3.635002 0.957395 1.521976
N  2.269042 1.72364 -0.23957
C  -1.98628 -0.428629 -0.349609
C  -3.21625 -1.031847 -0.128862
C  -0.87751 -2.395684 -0.40064
C  -3.217689 -2.414255 -0.014511
C  -2.030243 -3.116946 -0.150894
C  -4.496487 -0.265036 -0.128246
C  0.474042 -3.034287 -0.576143
C  0.032538 1.00647 1.485757
C  2.468731 1.225807 0.968584
C  4.705399 1.215416 0.783953
C  3.350431 1.97874 -0.9701
C  4.631362 1.741167 -0.501113
C  -6.451437 0.185767 1.087764
C  6.003956 0.399555 2.58291
C  1.887173 2.719506 -2.675693
H  -4.139499 -2.948874 0.170052
H  -2.027216 -4.19312 -0.060023
H  1.595995 0.55853 2.669289
H  5.510569 1.948355 -1.093544
H  -6.344312 1.267766 1.015504
H  -7.145533 -0.166619 0.325335
H  -6.829521 -0.074768 2.07195
H  5.58899 1.062535 3.34227
H  7.067809 0.270206 2.764346
H  5.509495 -0.570125 2.643642
H  2.018844 3.12494 -3.675355
H  1.303398 1.800642 -2.745132
H  1.358109 3.45306 -2.066232
H  0.488692 1.768494 -0.368398
elementType: S F O N C H
totalener: -2078.34792334 hartree
nucrepener: 3606.16381274 hartree
electener: -5684.51173607 hartree
twoeener: 4347.79368588 hartree
cpcmener: -0.04627687 hartree
kineticenergy: 2071.23156516 hartree
xcener: -168.054792949714 hartree
chargesum: -0.0000000
charge: 0.872153 -0.170162 -0.168006 -0.171942 -0.493144 -0.475296 -0.263027 -0.403914 -0.442619 -0.290713 -0.288109 -0.309783 -0.196382 -0.132110 -0.422479 -0.424206 0.074941 0.049735 0.097675 -0.100925 -0.089501 0.416815 0.520580 0.334406 0.365944 0.414221 0.419777 -0.320648 -0.122675 -0.116114 -0.124462 0.160487 0.157609 0.192108 0.145356 0.121733 0.123179 0.132770 0.113489 0.131593 0.113799 0.138108 0.108368 0.117243 0.204129
qa: 0.8722 -0.1702 -0.1680 -0.1719 -0.4931 -0.4753 -0.2630 -0.4039 -0.4426 -0.2907 -0.2881 -0.3098 -0.1964 -0.1321 -0.4225 -0.4242 0.0749 0.0497 0.0977 -0.1009 -0.0895 0.4168 0.5206 0.3344 0.3659 0.4142 0.4198 -0.3206 -0.1227 -0.1161 -0.1245 0.1605 0.1576 0.1921 0.1454 0.1217 0.1232 0.1328 0.1135 0.1316 0.1138 0.1381 0.1084 0.1172 0.2041
va: 5.7845 1.1365 1.1328 1.1363 1.9909 2.0128 2.1529 2.1002 2.0671 2.1325 2.1428 3.0693 3.0852 3.1922 2.9659 2.9788 3.9498 3.7063 3.9052 4.0354 3.9499 4.1770 4.4682 4.4391 4.2436 4.0267 3.9939 3.9284 3.8490 3.8486 3.8436 1.0022 1.0017 1.0168 1.0162 0.9941 0.9919 0.9938 0.9956 0.9935 0.9958 0.9956 0.9976 0.9909 1.0825
dispcorr: -0.024668054 hartree
energy: -2078.372591389522
dipole: 1.16891 -0.31675 0.85217 15.45637 -17.60714 -2.15077 6.28467 -5.25998 1.02469
magnitude: 2.53021 au
magnitude: 6.43129 debye
