program: Orca
programVersion: 4.2.1
elementType: S F F F O O O O O O O N N N N N C C C C C C C C C C C C C C C H H H H H H H H H H H H H H
charge: 0
multiplicity: 1
keywords: wb97x-d3
keywords: def2-TZVPP
keywords: def2/J RIJCOSX GRIDX6 NOFINALGRIDX
keywords: grid4 nofinalgrid
keywords: scfconv7
keywords: smallprint printgap noloewdin
keywords: NOSOSCF
formula: C15H14F3N5O7S
InChI: InChI=1S/C15H14F3N5O7S/c1-28-9-6-10(29-2)21-13(20-9)22-14(25)23-31(26,27)11-7(12(24)30-3)4-5-8(19-11)15(16,17)18/h4-6,22-23H,1-3H3
45 atoms
S  -1.805236 1.395032 -0.277536
F  0.979874 -2.687982 -1.804798
F  1.319146 -2.561504 0.313761
F  0.410899 -4.325308 -0.526614
O  -1.704099 1.896539 -1.631483
O  -2.788545 1.922873 0.6402
O  -5.232624 -0.521528 0.92648
O  -4.805651 0.520134 -1.012176
O  -0.754298 0.532275 2.322373
O  5.927146 0.875576 1.218593
O  3.176065 2.483266 -2.157416
N  -0.868073 -1.043375 -0.467284
N  -0.285432 1.564777 0.351685
N  1.409736 0.885583 1.787516
N  3.664274 0.883358 1.506064
N  2.272093 1.698589 -0.212819
C  -1.993907 -0.397271 -0.318637
C  -3.228129 -1.007229 -0.139787
C  -0.888383 -2.364038 -0.433291
C  -3.233267 -2.392876 -0.08061
C  -2.045239 -3.092212 -0.228524
C  -4.504143 -0.234537 -0.126557
C  0.465206 -2.997086 -0.613902
C  0.062302 0.966602 1.541709
C  2.49028 1.173555 0.980375
C  4.722839 1.148301 0.753538
C  3.341968 1.959962 -0.958115
C  4.629269 1.702473 -0.518213
C  -6.502752 0.130045 1.045946
C  6.049628 0.287848 2.511452
C  1.854149 2.747996 -2.620489
H  -4.158349 -2.932735 0.06859
H  -2.044094 -4.171182 -0.181697
H  1.645098 0.469509 2.679369
H  5.498957 1.915493 -1.122433
H  -7.167462 -0.151586 0.229985
H  -6.920397 -0.209311 1.988873
H  -6.387927 1.213216 1.069081
H  7.115791 0.147793 2.669024
H  5.549587 -0.67946 2.564408
H  5.654399 0.939507 3.290794
H  1.264475 1.833849 -2.702223
H  1.339254 3.468466 -1.983972
H  1.97121 3.177432 -3.611878
H  0.487501 1.77922 -0.297599
elementType: S F O N C H
totalener: -2078.34795448 hartree
nucrepener: 3608.23990687 hartree
electener: -5686.58786135 hartree
twoeener: 4349.89504999 hartree
cpcmener: -0.04646540 hartree
kineticenergy: 2071.23759359 hartree
xcener: -168.055993364036 hartree
chargesum: -0.0000000
charge: 0.872881 -0.170182 -0.168540 -0.172044 -0.492929 -0.474888 -0.263615 -0.403519 -0.442693 -0.290767 -0.288110 -0.310273 -0.196134 -0.131770 -0.422220 -0.423848 0.076721 0.047685 0.096609 -0.101254 -0.089928 0.418942 0.523144 0.331922 0.365244 0.414058 0.419170 -0.320632 -0.121003 -0.116445 -0.124932 0.160286 0.157416 0.191801 0.145212 0.123438 0.132307 0.120977 0.131629 0.113917 0.113636 0.108617 0.117235 0.138177 0.204704
qa: 0.8729 -0.1702 -0.1685 -0.1720 -0.4929 -0.4749 -0.2636 -0.4035 -0.4427 -0.2908 -0.2881 -0.3103 -0.1961 -0.1318 -0.4222 -0.4238 0.0767 0.0477 0.0966 -0.1013 -0.0899 0.4189 0.5231 0.3319 0.3652 0.4141 0.4192 -0.3206 -0.1210 -0.1164 -0.1249 0.1603 0.1574 0.1918 0.1452 0.1234 0.1323 0.1210 0.1316 0.1139 0.1136 0.1086 0.1172 0.1382 0.2047
va: 5.7846 1.1372 1.1325 1.1364 1.9900 2.0132 2.1540 2.1004 2.0675 2.1323 2.1426 3.0667 3.0868 3.1920 2.9656 2.9781 3.9467 3.7017 3.9068 4.0362 3.9510 4.1711 4.4647 4.4422 4.2434 4.0270 3.9940 3.9283 3.8491 3.8486 3.8436 1.0028 1.0018 1.0171 1.0163 0.9919 0.9939 0.9943 0.9935 0.9957 0.9955 0.9978 0.9907 0.9956 1.0814
dispcorr: -0.024680954 hartree
energy: -2078.372635437111
dipole: 1.09490 -0.31361 0.78129 14.88743 -17.16013 -2.27270 5.96821 -5.17615 0.79205
magnitude: 2.53040 au
magnitude: 6.43177 debye
