program: Orca
programVersion: 4.2.1
elementType: S F F F O O O O O O O N N N N N C C C C C C C C C C C C C C C H H H H H H H H H H H H H H
charge: 0
multiplicity: 1
keywords: wb97x-d3
keywords: def2-TZVPP
keywords: def2/J RIJCOSX GRIDX6 NOFINALGRIDX
keywords: grid4 nofinalgrid
keywords: scfconv7
keywords: smallprint printgap noloewdin
keywords: NOSOSCF
formula: C15H14F3N5O7S
InChI: InChI=1S/C15H14F3N5O7S/c1-28-9-6-10(29-2)21-13(20-9)22-14(25)23-31(26,27)11-7(12(24)30-3)4-5-8(19-11)15(16,17)18/h4-6,22-23H,1-3H3
45 atoms
S  -1.800377 1.426817 -0.151775
F  0.999346 -2.58376 -1.802121
F  1.2850 -2.589044 0.328079
F  0.386168 -4.290894 -0.640645
O  -1.726303 1.992652 -1.48174
O  -2.759152 1.912943 0.813445
O  -5.294115 -0.571178 0.857816
O  -4.761862 0.644773 -0.948487
O  -0.695536 0.469726 2.398221
O  5.961185 0.814098 1.153644
O  3.139355 2.479064 -2.135296
N  -0.873784 -1.007554 -0.433704
N  -0.265208 1.560952 0.449094
N  1.457369 0.828041 1.824371
N  3.705322 0.823825 1.492369
N  2.277893 1.672724 -0.180363
C  -1.997843 -0.361214 -0.27551
C  -3.238591 -0.971959 -0.145442
C  -0.901358 -2.328431 -0.460131
C  -3.251529 -2.358758 -0.147397
C  -2.064763 -3.058186 -0.306582
C  -4.509239 -0.192544 -0.123374
C  0.452208 -2.960409 -0.645686
C  0.104628 0.922471 1.611281
C  2.520507 1.126405 0.998512
C  4.747464 1.097145 0.720092
C  3.331143 1.939851 -0.946825
C  4.627124 1.669559 -0.541374
C  -6.572753 0.066407 0.962559
C  6.110643 0.210208 2.435749
C  1.807857 2.75234 -2.564951
H  -4.181479 -2.899842 -0.038557
H  -2.070555 -4.138098 -0.308207
H  1.710079 0.39015 2.700875
H  5.483605 1.886146 -1.162986
H  -6.465733 1.1425 1.09479
H  -7.186459 -0.137048 0.085486
H  -7.043933 -0.361064 1.842451
H  5.608407 -0.75592 2.487868
H  5.735167 0.853468 3.23176
H  7.179646 0.065134 2.568023
H  1.211661 1.841797 -2.637897
H  1.312152 3.471732 -1.912346
H  1.902841 3.187051 -3.556305
H  0.495264 1.781816 -0.212737
elementType: S F O N C H
totalener: -2078.34815100 hartree
nucrepener: 3609.59529437 hartree
electener: -5687.94344536 hartree
twoeener: 4351.26815814 hartree
cpcmener: -0.04683623 hartree
kineticenergy: 2071.23589707 hartree
xcener: -168.056037506216 hartree
chargesum: 0.0000000
charge: 0.873818 -0.170553 -0.169119 -0.172005 -0.494006 -0.474554 -0.264998 -0.404061 -0.442094 -0.290769 -0.288183 -0.311309 -0.195630 -0.132350 -0.422030 -0.422883 0.080353 0.045104 0.095715 -0.100649 -0.090939 0.422301 0.525693 0.330701 0.364812 0.414224 0.418248 -0.320511 -0.120683 -0.116605 -0.123980 0.159952 0.157507 0.191719 0.145198 0.121737 0.123389 0.132052 0.113916 0.113669 0.131560 0.107870 0.116908 0.137952 0.203512
qa: 0.8738 -0.1706 -0.1691 -0.1720 -0.4940 -0.4746 -0.2650 -0.4041 -0.4421 -0.2908 -0.2882 -0.3113 -0.1956 -0.1323 -0.4220 -0.4229 0.0804 0.0451 0.0957 -0.1006 -0.0909 0.4223 0.5257 0.3307 0.3648 0.4142 0.4182 -0.3205 -0.1207 -0.1166 -0.1240 0.1600 0.1575 0.1917 0.1452 0.1217 0.1234 0.1321 0.1139 0.1137 0.1316 0.1079 0.1169 0.1380 0.2035
va: 5.7846 1.1372 1.1323 1.1366 1.9875 2.0138 2.1553 2.0993 2.0685 2.1321 2.1425 3.0638 3.0891 3.1914 2.9659 2.9783 3.9419 3.6962 3.9096 4.0354 3.9535 4.1642 4.4604 4.4442 4.2444 4.0265 3.9942 3.9282 3.8486 3.8487 3.8440 1.0036 1.0019 1.0171 1.0163 0.9938 0.9922 0.9938 0.9957 0.9955 0.9935 0.9980 0.9909 0.9959 1.0831
dispcorr: -0.024686681 hartree
energy: -2078.372837678802
dipole: 0.96575 -0.27480 0.69094 14.32495 -16.71584 -2.39089 5.44932 -4.93338 0.51594
magnitude: 2.54164 au
magnitude: 6.46035 debye
