program: Orca
programVersion: 4.2.1
elementType: S F F F O O O O O O O N N N N N C C C C C C C C C C C C C C C H H H H H H H H H H H H H H
charge: 0
multiplicity: 1
keywords: wb97x-d3
keywords: def2-TZVPP
keywords: def2/J RIJCOSX GRIDX6 NOFINALGRIDX
keywords: grid4 nofinalgrid
keywords: scfconv7
keywords: smallprint printgap noloewdin
keywords: NOSOSCF
formula: C15H14F3N5O7S
InChI: InChI=1S/C15H14F3N5O7S/c1-28-9-6-10(29-2)21-13(20-9)22-14(25)23-31(26,27)11-7(12(24)30-3)4-5-8(19-11)15(16,17)18/h4-6,22-23H,1-3H3
45 atoms
S  -1.983169 1.39286 0.509623
F  1.530735 -2.507354 0.393231
F  1.116159 -3.519608 -1.462043
F  1.655516 -1.432938 -1.463855
O  -2.047793 2.311856 -0.606404
O  -2.96354 1.432226 1.568658
O  -4.554491 0.599321 -0.673079
O  -5.302418 -1.252534 0.344369
O  -0.654783 0.110094 2.852331
O  2.549446 2.728143 -1.85893
O  5.508094 -0.215065 0.172677
N  -0.677966 -0.734631 -0.290914
N  -0.457045 1.589762 1.125261
N  1.399738 0.492159 2.00535
N  1.958872 1.650116 0.066636
N  3.459404 0.157638 1.104034
C  -1.900809 -0.307091 -0.115408
C  -3.029493 -1.095298 -0.313093
C  -0.483029 -1.984167 -0.672269
C  -2.812204 -2.415636 -0.676991
C  -1.519182 -2.877168 -0.86837
C  -4.425974 -0.602021 -0.158243
C  0.967601 -2.367597 -0.809999
C  0.041625 0.687963 2.051261
C  2.307566 0.791635 1.00892
C  2.851622 1.88523 -0.889835
C  4.341472 0.401801 0.145807
C  4.095893 1.278302 -0.904857
C  -5.808093 1.268648 -0.506562
C  1.259836 3.334313 -1.872676
C  5.760851 -1.160154 1.208568
H  -3.650491 -3.082723 -0.825146
H  -1.346512 -3.90414 -1.154981
H  1.74528 -0.150216 2.706588
H  4.820668 1.466782 -1.68337
H  -6.046135 1.398471 0.548445
H  -5.688027 2.241096 -0.973611
H  -6.612005 0.724541 -1.000128
H  1.07639 3.92145 -0.97229
H  0.468779 2.594318 -2.000763
H  1.257638 3.999671 -2.732025
H  5.042013 -1.979621 1.189817
H  6.755174 -1.552051 1.011134
H  5.747759 -0.6945 2.194072
H  0.243236 1.933518 0.447006
elementType: S F O N C H
totalener: -2078.34373380 hartree
nucrepener: 3727.76019752 hartree
electener: -5806.10393131 hartree
twoeener: 4468.57359565 hartree
cpcmener: -0.04291802 hartree
kineticenergy: 2071.24140311 hartree
xcener: -168.056159378970 hartree
chargesum: 0.0000000
charge: 0.878693 -0.173650 -0.170238 -0.170440 -0.495401 -0.468860 -0.262641 -0.416423 -0.423923 -0.288216 -0.291456 -0.323646 -0.194580 -0.137680 -0.401861 -0.399400 0.103101 0.011263 0.095519 -0.073802 -0.110730 0.432169 0.558217 0.308819 0.328774 0.416299 0.410065 -0.319150 -0.125477 -0.120624 -0.116274 0.157209 0.157676 0.190349 0.143403 0.125248 0.129875 0.127019 0.117496 0.103308 0.137686 0.111449 0.131893 0.113373 0.195568
qa: 0.8787 -0.1737 -0.1702 -0.1704 -0.4954 -0.4689 -0.2626 -0.4164 -0.4239 -0.2882 -0.2915 -0.3236 -0.1946 -0.1377 -0.4019 -0.3994 0.1031 0.0113 0.0955 -0.0738 -0.1107 0.4322 0.5582 0.3088 0.3288 0.4163 0.4101 -0.3191 -0.1255 -0.1206 -0.1163 0.1572 0.1577 0.1903 0.1434 0.1252 0.1299 0.1270 0.1175 0.1033 0.1377 0.1114 0.1319 0.1134 0.1956
va: 5.7841 1.1264 1.1412 1.1391 1.9824 2.0142 2.1406 2.0930 2.0860 2.1407 2.1307 3.0590 3.0846 3.1843 2.9801 2.9416 3.9546 3.7255 3.9056 4.0054 4.0105 4.1494 4.4089 4.4746 4.2569 3.9808 4.0194 3.9461 3.8472 3.8439 3.8524 1.0052 1.0036 1.0184 1.0167 0.9945 0.9951 0.9935 0.9896 1.0028 0.9958 0.9971 0.9937 0.9953 1.0965
dispcorr: -0.028067984 hartree
energy: -2078.371801780833
dipole: -0.47393 1.99626 1.52232 13.29283 -14.45318 -1.16035 -0.87518 -1.11527 -1.99045
magnitude: 2.76148 au
magnitude: 7.01912 debye
