program: Orca
programVersion: 4.2.1
elementType: S F F F O O O O O O O N N N N N C C C C C C C C C C C C C C C H H H H H H H H H H H H H H
charge: 0
multiplicity: 1
keywords: wb97x-d3
keywords: def2-TZVPP
keywords: def2/J RIJCOSX GRIDX6 NOFINALGRIDX
keywords: grid4 nofinalgrid
keywords: scfconv7
keywords: smallprint printgap noloewdin
keywords: NOSOSCF
formula: C15H14F3N5O7S
InChI: InChI=1S/C15H14F3N5O7S/c1-28-9-6-10(29-2)21-13(20-9)22-14(25)23-31(26,27)11-7(12(24)30-3)4-5-8(19-11)15(16,17)18/h4-6,22-23H,1-3H3
45 atoms
S  -1.894232 1.302726 0.326478
F  0.540851 -4.175936 -1.001159
F  0.934819 -2.411698 -2.173172
F  1.41782 -2.437089 -0.077263
O  -1.916909 2.122478 -0.863732
O  -2.786262 1.525523 1.434053
O  -4.616826 0.681231 -0.522812
O  -5.475028 -1.023489 0.658723
O  -0.489802 -0.138608 2.53855
O  2.78161 2.846619 -1.906401
O  5.967541 0.677066 0.683798
N  -0.884657 -1.011277 -0.421044
N  -0.315914 1.371859 0.834178
N  1.571186 0.462898 1.843939
N  2.154393 1.681542 -0.047425
N  3.766311 0.570617 1.268249
C  -2.032387 -0.44471 -0.150329
C  -3.243338 -1.132562 -0.137753
C  -0.846979 -2.308929 -0.661048
C  -3.186848 -2.500687 -0.351673
C  -1.972095 -3.111859 -0.617368
C  -4.574551 -0.493883 0.073424
C  0.527319 -2.841489 -0.979147
C  0.186021 0.515813 1.790427
C  2.529304 0.930509 0.97543
C  3.111185 2.104065 -0.866831
C  4.710187 1.004353 0.446685
C  4.445972 1.793023 -0.66786
C  -5.746098 1.510777 -0.268991
C  1.411655 3.160813 -2.117669
C  6.25498 -0.132546 1.812991
H  -4.098045 -3.082485 -0.311649
H  -1.917078 -4.177592 -0.782561
H  1.925057 -0.141774 2.570069
H  5.224589 2.136879 -1.33094
H  -6.662546 1.057165 -0.644826
H  -5.850064 1.707095 0.797251
H  -5.550911 2.440562 -0.793655
H  1.383976 3.753517 -3.027624
H  0.997876 3.748381 -1.29703
H  0.801391 2.267369 -2.254734
H  5.75677 -1.100504 1.754356
H  7.331927 -0.277288 1.802609
H  5.962266 0.353334 2.744129
H  0.364833 1.738468 0.156936
totalener: -2078.32236829 hartree
nucrepener: 3638.11186266 hartree
electener: -5716.43423095 hartree
twoeener: 4378.42085350 hartree
kineticenergy: 2071.29011056 hartree
xcener: -168.056672951683 hartree
chargesum: -0.0000000
charge: 0.859680 -0.169715 -0.160568 -0.157437 -0.461061 -0.420120 -0.257526 -0.337257 -0.348397 -0.261847 -0.263060 -0.306825 -0.195961 -0.157109 -0.420366 -0.403113 0.093749 0.004915 0.074980 -0.087442 -0.109449 0.381735 0.517028 0.298534 0.362011 0.396895 0.383535 -0.298230 -0.138286 -0.127220 -0.126001 0.145383 0.143581 0.167801 0.129190 0.117541 0.127792 0.126832 0.127672 0.109907 0.107045 0.109765 0.123895 0.108255 0.189268
qa: 0.8597 -0.1697 -0.1606 -0.1574 -0.4611 -0.4201 -0.2575 -0.3373 -0.3484 -0.2618 -0.2631 -0.3068 -0.1960 -0.1571 -0.4204 -0.4031 0.0937 0.0049 0.0750 -0.0874 -0.1094 0.3817 0.5170 0.2985 0.3620 0.3969 0.3835 -0.2982 -0.1383 -0.1272 -0.1260 0.1454 0.1436 0.1678 0.1292 0.1175 0.1278 0.1268 0.1277 0.1099 0.1070 0.1098 0.1239 0.1083 0.1893
va: 5.8011 1.1370 1.1475 1.1468 2.0233 2.0691 2.1374 2.1671 2.1626 2.1610 2.1511 3.0617 3.1001 3.1793 2.9770 2.9690 3.9779 3.7334 3.9624 4.0065 3.9657 4.1991 4.4689 4.4473 4.2368 4.0236 4.0627 3.9353 3.8704 3.8681 3.8754 1.0134 1.0098 1.0357 1.0218 0.9935 0.9956 0.9942 0.9959 0.9941 1.0005 0.9968 0.9938 0.9968 1.0907
dispcorr: -0.025676216 hartree
energy: -2078.348044506456
dipole: 2.57693 -1.60741 0.96952 18.04879 -18.46979 -0.42100 2.28222 -3.19758 -0.91536
magnitude: 1.39825 au
magnitude: 3.55406 debye
