program: Orca
programVersion: 4.2.1
elementType: S F F F O O O O O O O N N N N N C C C C C C C C C C C C C C C H H H H H H H H H H H H H H
charge: 0
multiplicity: 1
keywords: wb97x-d3
keywords: def2-TZVPP
keywords: def2/J RIJCOSX GRIDX6 NOFINALGRIDX
keywords: grid4 nofinalgrid
keywords: scfconv7
keywords: smallprint printgap noloewdin
keywords: NOSOSCF
formula: C15H14F3N5O7S
InChI: InChI=1S/C15H14F3N5O7S/c1-28-9-6-10(29-2)21-13(20-9)22-14(25)23-31(26,27)11-7(12(24)30-3)4-5-8(19-11)15(16,17)18/h4-6,22-23H,1-3H3
45 atoms
S  -1.796896 0.84166 1.269053
F  1.133441 -1.349884 -2.191911
F  1.336744 -2.886521 -0.700887
F  0.461427 -3.354223 -2.613514
O  -2.940177 1.666418 0.98022
O  -1.41735 0.484115 2.616865
O  -4.199941 -0.637764 1.994903
O  -5.50752 -1.057667 0.219609
O  -1.205637 1.819112 -1.497603
O  5.552726 1.666178 -1.446967
O  3.439274 0.723843 2.579244
N  -0.815585 -1.049486 -0.277327
N  -0.42181 1.514093 0.627194
N  1.01983 1.940181 -1.147648
N  3.282129 1.806226 -1.29746
N  2.214725 1.333754 0.752387
C  -1.940612 -0.672471 0.273919
C  -3.155335 -1.318185 0.053513
C  -0.816359 -2.071271 -1.113688
C  -3.152256 -2.361193 -0.858933
C  -1.967373 -2.754155 -1.46061
C  -4.433104 -0.974396 0.741985
C  0.543365 -2.419913 -1.664049
C  -0.288182 1.756132 -0.724054
C  2.217907 1.677263 -0.525406
C  4.451014 1.558157 -0.726594
C  3.394205 1.0814 1.310044
C  4.58245 1.181281 0.605485
C  -5.285756 -0.116374 2.75414
C  5.434432 2.027791 -2.813913
C  2.221323 0.604295 3.301832
H  -4.080408 -2.866308 -1.090742
H  -1.954715 -3.565453 -2.173085
H  1.09972 2.150601 -2.131264
H  5.540885 0.977903 1.057368
H  -5.688865 0.781232 2.28696
H  -6.079686 -0.853902 2.866773
H  -4.871087 0.132763 3.725706
H  4.983066 3.012827 -2.93491
H  4.842811 1.303186 -3.373968
H  6.449657 2.044209 -3.201109
H  2.505383 0.304837 4.30672
H  1.681764 1.550985 3.351126
H  1.564541 -0.154627 2.875025
H  0.451569 1.320971 1.133732
totalener: -2078.32221861 hartree
nucrepener: 3648.97650796 hartree
electener: -5727.29872657 hartree
twoeener: 4389.26655611 hartree
kineticenergy: 2071.28865585 hartree
xcener: -168.056028028555 hartree
chargesum: 0.0000000
charge: 0.859493 -0.158875 -0.161255 -0.169705 -0.418436 -0.460573 -0.256839 -0.338354 -0.345421 -0.263271 -0.261863 -0.308024 -0.196352 -0.159162 -0.402424 -0.418359 0.097511 -0.003620 0.070496 -0.084336 -0.109941 0.384671 0.523309 0.295996 0.360607 0.384155 0.397315 -0.299021 -0.138568 -0.125778 -0.127513 0.145906 0.143871 0.168059 0.129322 0.127745 0.117643 0.127212 0.107821 0.110093 0.123651 0.127278 0.109644 0.107371 0.188522
qa: 0.8595 -0.1589 -0.1613 -0.1697 -0.4184 -0.4606 -0.2568 -0.3384 -0.3454 -0.2633 -0.2619 -0.3080 -0.1964 -0.1592 -0.4024 -0.4184 0.0975 -0.0036 0.0705 -0.0843 -0.1099 0.3847 0.5233 0.2960 0.3606 0.3842 0.3973 -0.2990 -0.1386 -0.1258 -0.1275 0.1459 0.1439 0.1681 0.1293 0.1277 0.1176 0.1272 0.1078 0.1101 0.1237 0.1273 0.1096 0.1074 0.1885
va: 5.8047 1.1457 1.1476 1.1375 2.0717 2.0232 2.1386 2.1661 2.1654 2.1509 2.1607 3.0623 3.1003 3.1786 2.9656 2.9767 3.9713 3.7401 3.9658 4.0037 3.9637 4.1956 4.4617 4.4504 4.2356 4.0619 4.0215 3.9352 3.8704 3.8758 3.8683 1.0136 1.0096 1.0355 1.0217 0.9954 0.9934 0.9941 0.9970 0.9968 0.9938 0.9961 0.9937 1.0009 1.0923
dispcorr: -0.025894830 hartree
energy: -2078.348113439761
dipole: 3.32346 -2.18339 1.14007 12.69694 -13.60040 -0.90346 11.40019 -11.41292 -0.01273
magnitude: 1.45470 au
magnitude: 3.69756 debye
