program: Orca
programVersion: 4.2.1
elementType: S F F F O O O O O O O N N N N N C C C C C C C C C C C C C C C H H H H H H H H H H H H H H
charge: 0
multiplicity: 1
keywords: wb97x-d3
keywords: def2-TZVPP
keywords: def2/J RIJCOSX GRIDX6 NOFINALGRIDX
keywords: grid4 nofinalgrid
keywords: scfconv7
keywords: smallprint printgap noloewdin
keywords: NOSOSCF
formula: C15H14F3N5O7S
InChI: InChI=1S/C15H14F3N5O7S/c1-28-9-6-10(29-2)21-13(20-9)22-14(25)23-31(26,27)11-7(12(24)30-3)4-5-8(19-11)15(16,17)18/h4-6,22-23H,1-3H3
45 atoms
S  -1.721157 1.144605 -0.743818
F  0.843501 -3.346605 -1.435044
F  1.282443 -2.756552 0.585983
F  0.245369 -4.607045 0.206615
O  -1.474086 1.326723 -2.154218
O  -2.753698 1.862444 -0.041328
O  -5.113739 -0.228874 0.939764
O  -4.851562 0.130481 -1.260352
O  -0.82439 0.765198 2.069086
O  5.834718 1.960769 1.596763
O  3.407466 2.143987 -2.35889
N  -0.872941 -1.324646 -0.430871
N  -0.245439 1.415981 -0.03595
N  1.333351 1.292191 1.663654
N  3.579777 1.62756 1.632192
N  2.351445 1.729712 -0.379329
C  -1.967557 -0.60862 -0.403308
C  -3.22182 -1.11231 -0.08209
C  -0.944247 -2.605381 -0.119242
C  -3.279059 -2.451802 0.26976
C  -2.126018 -3.220156 0.254741
C  -4.476223 -0.308194 -0.213461
C  0.371024 -3.338043 -0.190336
C  0.010355 1.129528 1.282432
C  2.463533 1.564221 0.928385
C  4.685861 1.883545 0.949753
C  3.469889 1.981068 -1.05162
C  4.702803 2.07636 -0.427249
C  -6.303904 0.555944 0.953228
C  5.835012 1.756762 3.00101
C  2.148067 2.0220 -3.007215
H  -4.222312 -2.899062 0.55337
H  -2.160013 -4.264009 0.529202
H  1.499262 1.119368 2.643683
H  5.61165 2.281109 -0.971504
H  -7.060113 0.149657 0.281737
H  -6.666513 0.526466 1.976295
H  -6.090884 1.585644 0.668491
H  5.485121 0.758169 3.264134
H  5.214243 2.489572 3.516991
H  6.86931 1.872722 3.313431
H  2.346884 2.175403 -4.064055
H  1.70982 1.033113 -2.866198
H  1.437816 2.776577 -2.666359
H  0.562057 1.551846 -0.654547
totalener: -2078.32129259 hartree
nucrepener: 3573.26686747 hartree
electener: -5651.58816005 hartree
oneelecener: -9965.43086727 hartree
twoeener: 4313.84270722 hartree
kineticenergy: 2071.28659328 hartree
xcener: -168.054571054215 hartree
chargesum: 0.0000000
charge: 0.859960 -0.157318 -0.159048 -0.172297 -0.448771 -0.427023 -0.254207 -0.310884 -0.365388 -0.263344 -0.260996 -0.295706 -0.206156 -0.162714 -0.407790 -0.426569 0.067124 0.073575 0.067159 -0.103494 -0.105906 0.342436 0.511038 0.327059 0.365418 0.385104 0.397542 -0.297203 -0.136292 -0.126015 -0.131743 0.133263 0.142266 0.167520 0.129574 0.111342 0.120898 0.126867 0.108660 0.108821 0.124162 0.128416 0.112971 0.108968 0.198724
qa: 0.8600 -0.1573 -0.1590 -0.1723 -0.4488 -0.4270 -0.2542 -0.3109 -0.3654 -0.2633 -0.2610 -0.2957 -0.2062 -0.1627 -0.4078 -0.4266 0.0671 0.0736 0.0672 -0.1035 -0.1059 0.3424 0.5110 0.3271 0.3654 0.3851 0.3975 -0.2972 -0.1363 -0.1260 -0.1317 0.1333 0.1423 0.1675 0.1296 0.1113 0.1209 0.1269 0.1087 0.1088 0.1242 0.1284 0.1130 0.1090 0.1987
va: 5.7989 1.1529 1.1459 1.1324 2.0440 2.0706 2.1395 2.1913 2.1481 2.1510 2.1613 3.0835 3.1029 3.1730 2.9739 2.9762 4.0048 3.7146 3.9697 4.0284 3.9541 4.2490 4.4866 4.4221 4.2427 4.0592 4.0239 3.9357 3.8805 3.8758 3.8666 1.0121 1.0097 1.0357 1.0215 0.9929 0.9937 0.9944 0.9968 0.9967 0.9939 0.9962 0.9966 0.9957 1.0769
dispcorr: -0.024155335 hartree
energy: -2078.345447921086
dipole: 1.95454 -1.41051 0.54403 19.82388 -20.61959 -0.79571 5.56529 -4.41318 1.15210
magnitude: 1.50216 au
magnitude: 3.81818 debye
