program: Orca
programVersion: 4.2.1
elementType: S F F F O O O O O O O N N N N N C C C C C C C C C C C C C C C H H H H H H H H H H H H H H
charge: 0
multiplicity: 1
keywords: wb97x-d3
keywords: def2-TZVPP
keywords: def2/J RIJCOSX GRIDX6 NOFINALGRIDX
keywords: grid4 nofinalgrid
keywords: scfconv7
keywords: smallprint printgap noloewdin
keywords: NOSOSCF
formula: C15H14F3N5O7S
InChI: InChI=1S/C15H14F3N5O7S/c1-28-9-6-10(29-2)21-13(20-9)22-14(25)23-31(26,27)11-7(12(24)30-3)4-5-8(19-11)15(16,17)18/h4-6,22-23H,1-3H3
45 atoms
S  -1.728956 1.373165 -0.017431
F  0.440434 -2.581336 -2.658636
F  1.164925 -2.772242 -0.642632
F  -0.023132 -4.345741 -1.512749
O  -1.647903 2.067689 -1.280219
O  -2.617948 1.788466 1.036945
O  -4.979427 -0.488914 1.479078
O  -4.954794 0.667574 -0.444552
O  -0.514747 -0.053141 2.294174
O  3.211993 2.842862 -1.850078
O  6.103053 1.058709 1.316512
N  -1.006271 -1.045875 -0.754278
N  -0.161076 1.340073 0.526851
N  1.608043 0.536665 1.800197
N  2.387658 1.709489 -0.049386
N  3.851396 0.798375 1.561028
C  -2.042599 -0.377353 -0.317656
C  -3.277851 -0.947957 -0.037281
C  -1.119265 -2.34945 -0.928848
C  -3.375768 -2.321249 -0.198616
C  -2.283468 -3.043626 -0.651361
C  -4.487142 -0.137407 0.305509
C  0.129412 -3.020792 -1.440938
C  0.238331 0.564586 1.587243
C  2.652612 1.043916 1.062963
C  3.427572 2.176433 -0.732552
C  4.87815 1.271372 0.870634
C  4.734054 1.987578 -0.312414
C  -6.113477 0.244506 1.936017
C  1.87399 3.022434 -2.295815
C  6.267182 0.323037 2.518611
H  -4.304168 -2.829528 0.024749
H  -2.3495 -4.113962 -0.77838
H  1.885342 -0.004702 2.605095
H  5.579146 2.366664 -0.86586
H  -6.969049 0.113115 1.273515
H  -6.34625 -0.152505 2.919658
H  -5.882799 1.306371 2.013608
H  1.382141 2.071211 -2.503247
H  1.946306 3.593803 -3.216749
H  1.274556 3.581765 -1.576376
H  5.784384 0.814581 3.363548
H  5.869347 -0.688352 2.431179
H  7.339312 0.277266 2.689706
H  0.569635 1.682824 -0.106903
totalener: -2078.32126969 hartree
nucrepener: 3575.19459474 hartree
electener: -5653.51586443 hartree
oneelecener: -9969.28594139 hartree
twoeener: 4315.77007696 hartree
kineticenergy: 2071.28362189 hartree
xcener: -168.053957221450 hartree
chargesum: 0.0000000
charge: 0.860577 -0.157168 -0.158859 -0.172228 -0.448844 -0.426765 -0.254587 -0.310756 -0.364912 -0.261258 -0.263151 -0.295935 -0.205793 -0.162335 -0.426824 -0.407942 0.065998 0.076478 0.067512 -0.103824 -0.106353 0.342432 0.510440 0.324508 0.365998 0.399656 0.385749 -0.299760 -0.136749 -0.132478 -0.125814 0.132838 0.141846 0.167460 0.129598 0.111197 0.121381 0.127080 0.113962 0.128358 0.108997 0.108084 0.108949 0.124307 0.198929
qa: 0.8606 -0.1572 -0.1589 -0.1722 -0.4488 -0.4268 -0.2546 -0.3108 -0.3649 -0.2613 -0.2632 -0.2959 -0.2058 -0.1623 -0.4268 -0.4079 0.0660 0.0765 0.0675 -0.1038 -0.1064 0.3424 0.5104 0.3245 0.3660 0.3997 0.3857 -0.2998 -0.1367 -0.1325 -0.1258 0.1328 0.1418 0.1675 0.1296 0.1112 0.1214 0.1271 0.1140 0.1284 0.1090 0.1081 0.1089 0.1243 0.1989
va: 5.7983 1.1531 1.1460 1.1323 2.0439 2.0711 2.1395 2.1912 2.1483 2.1615 2.1511 3.0828 3.1027 3.1733 2.9761 2.9731 4.0050 3.7111 3.9687 4.0285 3.9550 4.2474 4.4867 4.4235 4.2422 4.0213 4.0571 3.9345 3.8808 3.8661 3.8757 1.0124 1.0097 1.0357 1.0216 0.9929 0.9934 0.9943 0.9964 0.9960 0.9956 0.9969 0.9969 0.9937 1.0769
dispcorr: -0.024186549 hartree
energy: -2078.345456238793
dipole: 3.83490 -3.21542 0.61948 16.11170 -17.30268 -1.19099 11.90111 -11.23177 0.66934
magnitude: 1.50007 au
magnitude: 3.81288 debye
