program: Orca
programVersion: 4.2.1
elementType: S F F F O O O O O O O N N N N N C C C C C C C C C C C C C C C H H H H H H H H H H H H H H
charge: 0
multiplicity: 1
keywords: wb97x-d3
keywords: def2-TZVPP
keywords: def2/J RIJCOSX GRIDX6 NOFINALGRIDX
keywords: grid4 nofinalgrid
keywords: scfconv7
keywords: smallprint printgap noloewdin
keywords: NOSOSCF
formula: C15H14F3N5O7S
InChI: InChI=1S/C15H14F3N5O7S/c1-28-9-6-10(29-2)21-13(20-9)22-14(25)23-31(26,27)11-7(12(24)30-3)4-5-8(19-11)15(16,17)18/h4-6,22-23H,1-3H3
45 atoms
S  -1.792682 1.345697 -0.472671
F  0.922262 -2.94974 -1.687764
F  1.343258 -2.558385 0.385017
F  0.382288 -4.400477 -0.189221
O  -1.612186 1.716205 -1.856073
O  -2.80242 1.938382 0.364441
O  -5.214263 -0.440121 0.932661
O  -4.832119 0.367674 -1.125829
O  -0.774161 0.641647 2.236016
O  5.914377 1.347156 1.408067
O  3.258438 2.248782 -2.29379
N  -0.866939 -1.115654 -0.462162
N  -0.288531 1.550538 0.201417
N  1.3828 1.098734 1.751971
N  3.644551 1.225395 1.582778
N  2.301053 1.693672 -0.298892
C  -1.986395 -0.446949 -0.360044
C  -3.221936 -1.032839 -0.110688
C  -0.889881 -2.426176 -0.302936
C  -3.229125 -2.405287 0.084749
C  -2.047773 -3.123997 -0.010841
C  -4.50189 -0.263834 -0.165821
C  0.454135 -3.092676 -0.449438
C  0.030164 1.064909 1.44776
C  2.482956 1.354377 0.966823
C  4.722687 1.459059 0.849579
C  3.391682 1.918701 -1.023948
C  4.667044 1.817987 -0.492553
C  -6.44909 0.268717 1.007948
C  5.988595 0.972753 2.774569
C  1.951664 2.328983 -2.84838
H  -4.15571 -2.917344 0.306808
H  -2.042928 -4.193182 0.141223
H  1.598055 0.785706 2.686646
H  5.553469 2.001516 -1.07969
H  -6.286352 1.342497 0.923025
H  -7.140961 -0.049109 0.227726
H  -6.864959 0.037153 1.984133
H  7.048341 0.944062 3.01309
H  5.549805 -0.009943 2.949218
H  5.489806 1.695831 3.420283
H  1.346908 3.093817 -2.359663
H  2.092238 2.601078 -3.890464
H  1.426254 1.374697 -2.795446
H  0.493987 1.707309 -0.444884
totalener: -2078.32096814 hartree
nucrepener: 3595.69665366 hartree
electener: -5674.01762180 hartree
twoeener: 4336.28746227 hartree
kineticenergy: 2071.28294297 hartree
xcener: -168.053453823950 hartree
chargesum: 0.0000000
charge: 0.861255 -0.157996 -0.159120 -0.171687 -0.448503 -0.422827 -0.258610 -0.310515 -0.359888 -0.263123 -0.261568 -0.300209 -0.204576 -0.160783 -0.406306 -0.424001 0.068723 0.069509 0.066634 -0.105739 -0.105067 0.349479 0.514044 0.313739 0.365638 0.384807 0.398432 -0.299241 -0.134569 -0.125899 -0.129283 0.134248 0.142118 0.167223 0.128834 0.126484 0.111468 0.121119 0.123890 0.108415 0.108877 0.109128 0.127918 0.111741 0.195785
qa: 0.8613 -0.1580 -0.1591 -0.1717 -0.4485 -0.4228 -0.2586 -0.3105 -0.3599 -0.2631 -0.2616 -0.3002 -0.2046 -0.1608 -0.4063 -0.4240 0.0687 0.0695 0.0666 -0.1057 -0.1051 0.3495 0.5140 0.3137 0.3656 0.3848 0.3984 -0.2992 -0.1346 -0.1259 -0.1293 0.1342 0.1421 0.1672 0.1288 0.1265 0.1115 0.1211 0.1239 0.1084 0.1089 0.1091 0.1279 0.1117 0.1958
va: 5.8020 1.1523 1.1449 1.1335 2.0419 2.0758 2.1374 2.1914 2.1521 2.1507 2.1619 3.0739 3.1031 3.1749 2.9729 2.9766 3.9930 3.7043 3.9689 4.0301 3.9573 4.2340 4.4784 4.4318 4.2399 4.0604 4.0229 3.9360 3.8805 3.8761 3.8660 1.0136 1.0097 1.0358 1.0218 0.9943 0.9930 0.9935 0.9938 0.9970 0.9967 0.9950 0.9958 0.9984 1.0821
dispcorr: -0.024536471 hartree
energy: -2078.345504606276
dipole: 1.33373 -0.84511 0.48862 16.46649 -17.65946 -1.19297 5.91443 -5.07394 0.84049
magnitude: 1.53895 au
magnitude: 3.91169 debye
