program: Orca
programVersion: 4.2.1
elementType: S F F F O O O O O O O N N N N N C C C C C C C C C C C C C C C H H H H H H H H H H H H H H
charge: 0
multiplicity: 1
keywords: wb97x-d3
keywords: def2-TZVPP
keywords: def2/J RIJCOSX GRIDX6 NOFINALGRIDX
keywords: grid4 nofinalgrid
keywords: scfconv7
keywords: smallprint printgap noloewdin
keywords: NOSOSCF
formula: C15H14F3N5O7S
InChI: InChI=1S/C15H14F3N5O7S/c1-28-9-6-10(29-2)21-13(20-9)22-14(25)23-31(26,27)11-7(12(24)30-3)4-5-8(19-11)15(16,17)18/h4-6,22-23H,1-3H3
45 atoms
S  -1.990153 1.381551 0.534096
F  1.495202 -2.489176 0.276079
F  1.006035 -3.58542 -1.513805
F  1.55368 -1.503411 -1.633645
O  -2.024967 2.309846 -0.572944
O  -2.953832 1.411102 1.600972
O  -4.56392 0.675651 -0.599146
O  -5.392487 -1.269561 0.152148
O  -0.615319 -0.035853 2.805419
O  2.546793 2.632955 -1.905131
O  5.613779 -0.085183 0.277988
N  -0.729437 -0.762115 -0.329995
N  -0.447049 1.519528 1.133754
N  1.434154 0.450241 1.997899
N  1.97472 1.586805 0.041813
N  3.523276 0.190886 1.144432
C  -1.943285 -0.311766 -0.136091
C  -3.084776 -1.079928 -0.358512
C  -0.55405 -2.004658 -0.740667
C  -2.888268 -2.396118 -0.746941
C  -1.604826 -2.878089 -0.949871
C  -4.483337 -0.581181 -0.214469
C  0.891202 -2.401229 -0.909951
C  0.054625 0.59529 2.034425
C  2.340403 0.762213 1.009264
C  2.872894 1.836855 -0.904746
C  4.413842 0.461965 0.202733
C  4.146931 1.294177 -0.878322
C  -5.78712 1.366264 -0.365567
C  1.231705 3.168561 -1.954713
C  5.887446 -0.966415 1.355731
H  -3.745935 -3.038497 -0.895658
H  -1.44244 -3.900244 -1.25837
H  1.783718 -0.206135 2.680278
H  4.87756 1.499073 -1.645378
H  -6.033139 1.369163 0.695606
H  -5.618003 2.383687 -0.703649
H  -6.606847 0.918531 -0.926614
H  1.018361 3.803703 -1.093817
H  0.472805 2.38776 -2.013644
H  1.194523 3.770807 -2.85818
H  5.218377 -1.827428 1.353395
H  6.910653 -1.301247 1.20762
H  5.804831 -0.464866 2.320322
H  0.240609 1.869088 0.452431
totalener: -2078.32019280 hartree
nucrepener: 3714.80066974 hartree
electener: -5793.12086253 hartree
twoeener: 4454.98780733 hartree
kineticenergy: 2071.28749407 hartree
xcener: -168.054745689582 hartree
chargesum: 0.0000000
charge: 0.855495 -0.164678 -0.168125 -0.161406 -0.458889 -0.411981 -0.255891 -0.338904 -0.330973 -0.262073 -0.263796 -0.316283 -0.189036 -0.165391 -0.402749 -0.389960 0.111133 -0.026248 0.056911 -0.071385 -0.116388 0.383590 0.552458 0.280918 0.330969 0.398265 0.386694 -0.297314 -0.136536 -0.122999 -0.126665 0.145965 0.144361 0.168862 0.127251 0.127783 0.127241 0.117441 0.109642 0.102067 0.126114 0.109771 0.123534 0.107643 0.183563
qa: 0.8555 -0.1647 -0.1681 -0.1614 -0.4589 -0.4120 -0.2559 -0.3389 -0.3310 -0.2621 -0.2638 -0.3163 -0.1890 -0.1654 -0.4027 -0.3900 0.1111 -0.0262 0.0569 -0.0714 -0.1164 0.3836 0.5525 0.2809 0.3310 0.3983 0.3867 -0.2973 -0.1365 -0.1230 -0.1267 0.1460 0.1444 0.1689 0.1273 0.1278 0.1272 0.1174 0.1096 0.1021 0.1261 0.1098 0.1235 0.1076 0.1836
va: 5.8155 1.1379 1.1412 1.1495 2.0214 2.0777 2.1412 2.1656 2.1776 2.1599 2.1504 3.0568 3.0982 3.1712 2.9750 2.9493 3.9569 3.7633 3.9709 3.9929 3.9873 4.1974 4.4205 4.4657 4.2544 4.0082 4.0549 3.9484 3.8692 3.8690 3.8773 1.0140 1.0106 1.0351 1.0222 0.9954 0.9945 0.9934 0.9924 1.0048 0.9970 0.9974 0.9940 0.9967 1.1002
dispcorr: -0.027743085 hartree
energy: -2078.347935882387
dipole: 0.09864 0.85726 0.95590 13.84969 -14.44177 -0.59208 0.14771 -1.39981 -1.25211
magnitude: 1.68288 au
magnitude: 4.27753 debye
