program: Orca
programVersion: 4.2.1
elementType: S O O O O O O O N N N N N N C C C C C C C C C C C C C C H H H H H H H H H H H H H H H H H H
charge: 0
multiplicity: 1
keywords: wb97x-d3
keywords: def2-TZVPP
keywords: def2/J RIJCOSX GRIDX6 NOFINALGRIDX
keywords: grid4 nofinalgrid
keywords: scfconv7
keywords: smallprint printgap noloewdin
keywords: NOSOSCF
formula: C14H18N6O7S
InChI: InChI=1S/C14H18N6O7S/c1-5-27-12(21)8-7-15-20(2)11(8)28(23,24)19-14(22)18-13-16-9(25-3)6-10(17-13)26-4/h6-7,18-19H,5H2,1-4H3
46 atoms
S  1.860345 -1.937242 0.778639
O  1.767756 -1.658058 2.193049
O  2.469552 -3.170057 0.338897
O  0.937853 2.608132 0.044995
O  0.401408 0.87177 1.346059
O  0.901796 -2.08008 -1.979425
O  -2.95066 -0.156224 2.586879
O  -4.550251 1.830904 -1.288008
N  3.795432 -0.703749 -0.758811
N  0.311674 -1.833529 0.199807
N  4.164517 0.464466 -1.265785
N  -1.103957 -1.152495 -1.51711
N  -2.050293 -0.710474 0.557088
N  -2.832771 0.325893 -1.413784
C  2.666859 -0.590531 -0.036252
C  2.282907 0.743965 -0.084469
C  3.264634 1.343403 -0.879888
C  4.597191 -1.874419 -1.072298
C  1.116514 1.389024 0.521254
C  0.087221 -1.723183 -1.154219
C  -0.207272 3.34502 0.513132
C  -2.0352 -0.48261 -0.742763
C  -0.182396 4.698766 -0.145959
C  -2.914726 -0.000598 1.27562
C  -3.714065 1.001639 -0.687988
C  -3.798453 0.892975 0.694724
C  -2.04086 -1.062882 3.207882
C  -4.469793 1.997536 -2.701795
H  3.352554 2.377741 -1.169824
H  -0.413952 -1.452562 0.82545
H  5.447276 -1.524276 -1.646324
H  4.029522 -2.579589 -1.671597
H  4.957277 -2.355692 -0.168717
H  -0.168318 3.436454 1.599498
H  -1.117079 2.797375 0.253608
H  -0.222382 4.620592 -1.232284
H  -1.053592 5.265938 0.180037
H  0.706603 5.264573 0.132588
H  -4.508984 1.461992 1.275849
H  -1.005496 -0.753208 3.066668
H  -2.273004 -1.029201 4.268463
H  -2.175745 -2.082329 2.847636
H  -5.240845 2.719838 -2.954439
H  -3.499703 2.388834 -3.006659
H  -4.665909 1.065458 -3.230325
H  -1.212304 -1.030792 -2.515806
elementType: S O N C H
totalener: -1797.79861303 hartree
nucrepener: 3170.67303670 hartree
electener: -4968.47164973 hartree
oneelecener: -8770.32027454 hartree
twoeener: 3801.84862481 hartree
cpcmener: -0.04416078 hartree
kineticenergy: 1791.36546791 hartree
xcener: -147.480013038760 hartree
chargesum: 0.0000000
charge: 0.893934 -0.491686 -0.489510 -0.281134 -0.455935 -0.461389 -0.295722 -0.300156 0.180977 -0.213213 -0.316527 -0.131099 -0.403654 -0.407302 -0.113601 -0.031161 -0.059209 -0.148470 0.471964 0.343440 0.059435 0.324827 -0.259752 0.429364 0.415929 -0.319238 -0.118743 -0.114755 0.165004 0.227299 0.115890 0.125967 0.132596 0.106493 0.074244 0.090947 0.093953 0.093482 0.144607 0.099315 0.140490 0.124063 0.133069 0.114427 0.114726 0.195813
qa: 0.8939 -0.4917 -0.4895 -0.2811 -0.4559 -0.4614 -0.2957 -0.3002 0.1810 -0.2132 -0.3165 -0.1311 -0.4037 -0.4073 -0.1136 -0.0312 -0.0592 -0.1485 0.4720 0.3434 0.0594 0.3248 -0.2598 0.4294 0.4159 -0.3192 -0.1187 -0.1148 0.1650 0.2273 0.1159 0.1260 0.1326 0.1065 0.0742 0.0909 0.0940 0.0935 0.1446 0.0993 0.1405 0.1241 0.1331 0.1144 0.1147 0.1958
va: 5.8617 1.9945 2.0088 2.1497 2.0367 2.0405 2.1263 2.1182 3.3879 3.0717 2.9019 3.1882 2.9530 2.9486 4.0781 3.6079 4.1097 3.8513 4.1241 4.4258 3.8419 4.2708 3.9774 3.9649 3.9961 3.9279 3.8393 3.8462 1.0078 1.0559 1.0103 0.9977 0.9933 0.9993 0.9911 1.0028 1.0055 1.0033 1.0175 1.0016 0.9943 0.9896 0.9936 0.9953 0.9950 1.0144
dispcorr: -0.028211294 hartree
energy: -1797.826824325250
dipole: -8.63879 6.56197 -2.07682 17.68762 -15.16768 2.51994 -2.92180 1.96391 -0.95788
magnitude: 3.40306 au
magnitude: 8.64988 debye
