program: Gaussian 09
title: 000069141
version: EM64L-G09RevD.01
frameworkgroup: C1[X(C9H7NO)]
method: RPBEPBE
basis: SDD
operation: Freq
keyword: #pfreq=noraman
keyword: PBEPBE/SDD
title: #p freq=noraman PBEPBE/SDD
converged: NO YES NO YES
title: Mulliken charges:
elementType: O N C C C C C C C C C H H H H H H H
charge: -0.270555 -0.405124 0.168266 0.300909 0.118050 -0.351684 -0.378555 -0.288509 -0.210173 -0.252212 -0.203492 0.314065 0.280643 0.225283 0.249207 0.238818 0.234230 0.230836
chargesum: 0.00000
title: Mulliken charges with hydrogens summed into heavy atoms:
elementType: O N C C C C C C C C C
charge: -0.270555 -0.091059 0.168266 0.300909 0.118050 -0.071042 -0.153272 -0.039303 0.028645 -0.017982 0.027344
polarizability: 1.44601471e+02 -9.48996404e-01 1.24257680e+02 -1.33505200e-03 4.98122380e-04 4.16283230e+01
1716.lowfreq: -0.0009 -0.0008 0.0003 6.8881 9.9611 16.0450 118.1265 167.7119 236.7770
frequency: 118.1113 167.7115 236.7763 278.7699 403.8373 462.1890 472.1977 475.5195 524.8798 545.6546 567.3431 591.6055 668.7243 702.6440 764.7706 774.8615 787.9666 831.1340 874.6780 877.2608 948.9003 968.0682 1003.3135 1016.5805 1048.9202 1081.6549 1134.0369 1168.8551 1199.0310 1247.3242 1277.2885 1295.5463 1389.8368 1400.3968 1424.1126 1470.5379 1503.7148 1552.8947 1584.4666 1617.6832 1637.6854 3117.6979 3139.2661 3151.8102 3159.8496 3168.3883 3188.3438 3560.7311
redmass: 5.1685 4.1960 4.2602 6.5499 3.1668 6.2800 6.9112 3.5855 6.6013 3.1431 7.1082 1.1914 2.9436 5.8408 2.3699 1.3792 5.4558 1.8504 1.5535 5.1651 1.2888 1.3646 1.3325 3.0103 2.2808 2.5924 1.5017 1.0977 1.4207 1.8333 1.7932 1.9925 1.9480 7.2488 2.1859 2.8434 3.1408 7.4445 4.0390 6.9553 5.8327 1.0882 1.0883 1.0936 1.0889 1.1002 1.0985 1.0780
irintensity: 3.7904 0.5663 4.3630 7.6629 8.5220 7.4059 1.1608 2.2240 4.4222 9.5621 1.4664 81.4208 0.8297 0.1985 13.0846 127.4343 4.9013 32.0978 0.9398 2.7007 0.5988 2.6296 0.7286 11.7587 3.2152 9.3213 15.4446 6.5912 18.5793 2.9411 2.4405 9.8574 0.2303 31.7581 8.8806 66.1465 106.2102 121.9701 3.0021 116.5975 131.4920 8.2505 10.9067 6.7911 5.4834 25.9865 9.2290 54.2082
temp: 298.150 k
press: 1.00000 atm
elementType: 8 7 6 6 6 6 6 6 6 6 6 1 1 1 1 1 1 1
symmnumber: 1
zpe: 362370.2 jmol-1
zpe.correction: 0.138020 hartree
zpe.thermalcorrener: 0.145946 hartree
zpe.thermalcorrenthalpy: 0.146891 hartree
zpe.thermalcorrgfe: 0.105302 hartree
zpe.sumelectzpe: -476.389523 hartree
zpe.sumelectthermal: -476.381596 hartree
zpe.sumelectthermalent: -476.380652 hartree
zpe.sumelectthermalfe: -476.422241 hartree
dipole: 1.9785 -6.2574 -0.0003
dipole: 6.5627
quadrupole: -56.6648 -58.2562 -67.9034
quadrupole: 10.3086 0.0008 -0.0035
quadrupole: 4.2767 2.6852 -6.9620 10.3086 0.0008 -0.0035
hfenergy: -476.5275426 hartree
pointgroup: C01 [X(C9H7N1O1)]
dipole: 0.7578484 2.4682533 0.0001239 debye
dipolederiv: -0.5691124 -0.1606465 0.0000218 -0.3621078 -1.1257423 0.0001347 -0.0001033 -0.0002988 -0.3712262 -1.0074668 -0.1950132 -0.0000059 0.1641051 -0.5610412 -0.0000302 -0.0001118 -0.0002307 -0.267335 -0.4095702 -0.2883213 -0.0000139 0.0069299 -0.1855126 -0.0000051 0.0000916 0.0000068 -0.0153525 0.5561061 -0.3218089 -0.0000285 -0.400853 0.2672099 -0.0000407 0.0001144 0.0000557 0.0780672 0.7840334 0.0143716 0.0000398 0.3698685 1.2640295 -0.0000625 -0.0000287 0.0001569 0.1623318 0.0674589 0.1602297 -0.0000316 -0.1073152 0.0503184 -0.0000238 -0.0000058 -0.000018 -0.1050596 -0.2295943 0.2230243 -0.0000055 0.047825 0.0548251 -0.000001 0.0000082 -0.0000124 -0.1940917 -0.0592229 0.3229584 0.0000206 -0.1387001 -0.674648 0.0000006 -0.0000104 0.0000662 -0.2368445 0.7060527 0.4718469 0.0000561 0.3791364 0.5742033 -0.000061 0.0000799 0.0001233 -0.0625333 -0.1005099 -0.2303943 -0.0000108 -0.1475048 -0.0889636 0.000012 0.0000025 0.0000285 -0.1796341 0.1187119 -0.0109389 -0.0000156 0.0994824 0.1910315 -0.0000082 -0.0000225 -0.0000135 -0.1361267 0.13715 -0.0451405 -0.0000003 0.0026046 0.2150713 0.0000228 -0.0000024 0.00007 0.3305386 0.1207311 -0.0604625 0.0000107 0.0194274 0.0066293 0.0000165 0.0000116 0.0000047 0.1533653 0.0735641 0.0118019 0.0000018 -0.0437692 -0.1257962 0.0000115 -0.0000148 0.0000286 0.1726622 -0.0595509 0.0005866 -0.0000222 -0.034143 0.0829066 0.0000112 -0.0000342 -0.0000105 0.1748008 0.0176045 0.0759407 -0.0000336 0.1084741 -0.0207006 0.0000193 0.0000033 0.0000513 0.1734018 -0.0414984 0.0974992 0.000004 0.1044949 0.00122 -0.0000017 -0.0000005 -0.0000101 0.1660674 -0.104887 -0.0655331 0.000013 -0.0679553 0.0749595 0.0000057 0.0000231 0.0000021 0.1569684 unknown
polarizability: 144.5842228|1.1185671|124.2749288|0.0013309|0.0005092|41.628323 unknown
InChI: InChI=1S/C9H7NO/c11-9-5-6-10-8-4-2-1-3-7(8)9/h1-6,10H
charge 0 multiplicity 1
18 atoms
O  -1.691238 -2.213869 -0.000302
N  -0.726414 1.83395 0.000082
C  0.020667 -0.488707 0.000182
C  0.328689 0.907601 0.000109
C  -1.396066 -0.969422 0.000404
C  1.091169 -1.420974 0.000131
C  1.680191 1.350174 0.000035
C  -2.403915 0.093765 0.000016
C  -2.052293 1.428369 -0.00003
C  2.427342 -0.988496 0.000043
C  2.718546 0.404205 0.000006
H  -0.501795 2.829577 -0.000086
H  0.825699 -2.483815 0.000209
H  1.9077 2.42361 -0.000011
H  -3.457683 -0.196737 -0.000156
H  -2.796354 2.230054 -0.000191
H  3.2444 -1.717187 0.000019
H  3.759457 0.746202 -0.00006
