program: Gaussian 09
title: 000069142
version: EM64L-G09RevD.01
frameworkgroup: C1[X(C14H14)]
method: RPBEPBE
basis: SDD
operation: Freq
keyword: #p
keyword: freq=noraman
keyword: PBEPBE/SDD
title: #p freq=noraman PBEPBE/SDD
converged: YES YES NO NO
title: Mulliken charges:
elementType: C C C C C C C C C C C C C C H H H H H H H H H H H H H H
charge: 0.207844 0.325822 0.261484 -0.569985 0.444866 -0.390290 -0.388809 -0.382239 -0.402786 -0.830338 -0.228613 -0.251257 -0.240040 -0.815458 0.251256 0.237138 0.247813 0.227981 0.231997 0.227392 0.247520 0.226268 0.223964 0.226530 0.226190 0.227332 0.223492 0.234929
chargesum: 0.00000
title: Mulliken charges with hydrogens summed into heavy atoms:
elementType: C C C C C C C C C C C C C C
charge: 0.207844 0.325822 0.261484 -0.318729 0.444866 -0.153152 -0.140996 -0.154258 -0.170789 -0.129159 -0.004649 -0.024727 -0.013850 -0.129704
polarizability: 2.14209439e+02 -5.91259526e+00 1.49811939e+02 2.47424222e+00 -1.41394395e+00 8.55345789e+01
1716.lowfreq: -9.8883 -5.1124 -4.4845 -0.0003 0.0001 0.0004 17.5712 47.5261 79.6377
frequency: 17.1544 47.5117 79.6250 102.4811 165.7436 182.0318 208.1273 258.3570 273.8459 307.3931 365.3064 407.2748 447.0235 461.0246 515.8129 520.3486 549.0518 589.7935 619.3340 693.7789 711.5212 733.7243 761.6266 781.0259 801.4493 859.8010 873.5846 897.9448 916.4282 949.3041 980.5486 984.7016 986.0643 986.9568 990.7180 1035.3646 1043.3277 1048.3996 1056.9564 1096.0998 1121.2701 1174.4245 1181.7004 1195.9629 1212.8133 1276.1598 1295.6135 1308.6907 1361.2459 1369.9732 1398.8610 1399.4005 1414.1857 1428.4764 1468.1955 1471.2928 1473.8869 1474.3513 1479.2809 1496.1466 1578.3343 1592.3867 1609.9055 1613.2626 2974.4241 2976.0132 3055.4623 3055.6509 3084.3090 3090.9379 3115.7451 3117.5162 3120.0277 3126.4198 3136.4810 3140.3733 3157.5156 3160.1758
redmass: 1.0173 3.5933 4.0865 3.9254 1.0537 2.9297 3.0308 3.8604 3.6581 4.4015 2.7571 3.0438 2.8798 2.8642 5.1816 4.0798 4.3837 3.8052 6.9474 5.7693 2.1819 2.3549 1.3743 4.2738 1.6146 3.5172 1.4149 1.3117 1.4042 1.3911 1.3675 1.6863 1.5282 1.5697 2.9813 2.6853 1.5469 1.5633 2.1538 1.6331 1.5990 1.0646 1.1320 1.8833 2.2632 1.5900 2.4055 1.4115 6.0262 7.8089 1.2263 1.2266 2.7772 2.0870 1.1416 1.4139 1.1883 1.2475 1.3153 2.2491 6.0632 5.9190 6.1466 6.2158 1.0387 1.0395 1.0943 1.0949 1.0997 1.0994 1.0862 1.0872 1.0902 1.0880 1.0917 1.0939 1.0984 1.1009
irintensity: 0.5325 0.2039 0.6277 0.2709 0.5658 2.1241 2.2053 0.1664 1.6671 0.3412 1.1371 1.4728 4.6893 6.8004 1.6898 0.0460 0.7889 1.2088 5.1585 0.2278 19.5861 8.2339 95.9875 4.7054 23.4724 5.2574 0.3493 2.9302 2.5444 0.3250 0.9005 1.1657 0.3978 0.3811 1.6266 4.3759 8.2050 15.4889 3.2700 7.0424 11.1905 0.5602 0.2682 0.8425 0.0726 2.0430 1.4660 0.1315 1.0856 0.3423 12.0017 13.4344 5.4946 2.9672 17.2156 3.1447 3.3434 24.2090 49.0921 2.2912 2.2730 7.7448 1.2529 25.2624 37.7705 26.4906 10.5418 35.8947 18.0460 17.3093 10.7509 5.3930 15.4056 2.5328 26.2344 34.8369 24.2756 30.0004
temp: 298.150 k
press: 1.00000 atm
elementType: 6 6 6 6 6 6 6 6 6 6 6 6 6 6 1 1 1 1 1 1 1 1 1 1 1 1 1 1
symmnumber: 1
zpe: 610175.9 jmol-1
zpe.correction: 0.232404 hartree
zpe.thermalcorrener: 0.245085 hartree
zpe.thermalcorrenthalpy: 0.246029 hartree
zpe.thermalcorrgfe: 0.191969 hartree
zpe.sumelectzpe: -540.915896 hartree
zpe.sumelectthermal: -540.903215 hartree
zpe.sumelectthermalent: -540.902271 hartree
zpe.sumelectthermalfe: -540.956331 hartree
dipole: -0.4768 0.0662 0.2218
dipole: 0.5300
quadrupole: -73.0087 -75.5651 -86.7401
quadrupole: 1.3723 0.5490 -0.3913
quadrupole: 5.4293 2.8729 -8.3021 1.3723 0.5490 -0.3913
hfenergy: -541.1483001 hartree
pointgroup: C01 [X(C14H14)]
dipole: -0.1893751 0.0605006 0.0629323 debye
polarizability: 214.6722834|0.5125404|127.3635171|3.6487221|-30.3169447|107.5201564 unknown
InChI: InChI=1S/C14H14/c1-11-6-5-8-13(10-11)14-9-4-3-7-12(14)2/h3-10H,1-2H3
charge 0 multiplicity 1
28 atoms
C  0.931446 -0.062567 0.024079
C  -0.55169 0.062704 -0.142937
C  1.831145 1.039211 -0.141511
C  -1.423533 -0.470108 0.845471
C  -2.833035 -0.411225 0.71577
C  -1.128717 0.666057 -1.292553
C  1.461686 -1.335325 0.378086
C  3.220737 0.814294 0.041773
C  -3.379831 0.203257 -0.439992
C  1.360505 2.449084 -0.469509
C  -2.53079 0.73386 -1.43684
C  2.845426 -1.54052 0.552161
C  3.734692 -0.456374 0.378113
C  -3.736837 -1.009161 1.781336
H  -0.988521 -0.920358 1.746843
H  -0.480158 1.058749 -2.08281
H  0.770216 -2.178386 0.490538
H  3.908818 1.661225 -0.072921
H  -4.468745 0.265267 -0.557267
H  1.293863 2.615127 -1.562266
H  0.362398 2.65961 -0.049919
H  2.070565 3.195025 -0.070896
H  -2.962252 1.19812 -2.331035
H  3.224962 -2.534418 0.814006
H  4.813593 -0.596035 0.510005
H  -3.267004 -0.970763 2.779965
H  -4.703191 -0.47752 1.837357
H  -3.959051 -2.072128 1.563451
