program: Orca
programVersion: 4.2.1
elementType: S O O O O O O O N N N N N N C C C C C C C C C C C C C C H H H H H H H H H H H H H H H H H H
charge: 0
multiplicity: 1
keywords: wb97x-d3
keywords: def2-TZVPP
keywords: def2/J RIJCOSX GRIDX6 NOFINALGRIDX
keywords: grid4 nofinalgrid
keywords: scfconv7
keywords: smallprint printgap noloewdin
keywords: NOSOSCF
formula: C14H18N6O7S
InChI: InChI=1S/C14H18N6O7S/c1-5-27-12(21)8-7-15-20(2)11(8)28(23,24)19-14(22)18-13-16-9(25-3)6-10(17-13)26-4/h6-7,18-19H,5H2,1-4H3
46 atoms
S  1.826106 -1.359711 1.353763
O  1.824737 -0.45787 2.482675
O  2.346058 -2.696968 1.520094
O  1.655514 2.810068 -0.811471
O  0.58579 1.503781 0.656327
O  0.734677 -2.662772 -1.00655
O  -2.981616 1.082301 2.40055
O  -5.232389 0.475228 -1.6112
N  3.685633 -1.147134 -0.677125
N  0.255629 -1.430247 0.837631
N  4.158284 -0.318603 -1.597635
N  -1.31236 -1.726206 -0.85379
N  -2.137384 -0.334171 0.814074
N  -3.273795 -0.641351 -1.231612
C  2.669078 -0.591008 0.006496
C  2.478187 0.684827 -0.508215
C  3.44703 0.785255 -1.511764
C  4.27397 -2.472295 -0.578187
C  1.473092 1.685268 -0.142201
C  -0.055051 -1.987578 -0.37834
C  0.720911 3.882744 -0.589365
C  -2.280047 -0.855473 -0.39055
C  1.144248 5.045349 -1.448315
C  -3.075769 0.521322 1.207674
C  -4.20701 0.206337 -0.821183
C  -4.162435 0.842925 0.41318
C  -1.897593 0.7228 3.255485
C  -5.309081 -0.1555 -2.887987
H  3.646031 1.613736 -2.171687
H  -0.427854 -0.77511 1.246032
H  3.526294 -3.237667 -0.757289
H  4.73975 -2.623862 0.390221
H  5.034097 -2.532164 -1.348477
H  0.72432 4.156325 0.466803
H  -0.284177 3.547675 -0.850908
H  2.13836 5.403443 -1.181501
H  1.136373 4.789585 -2.507638
H  0.444025 5.866727 -1.299258
H  -4.926764 1.534771 0.734413
H  -0.937364 1.018096 2.833606
H  -2.058524 1.27237 4.17836
H  -1.893874 -0.344622 3.475228
H  -5.387131 -1.238323 -2.79783
H  -6.213547 0.229983 -3.349781
H  -4.453469 0.094432 -3.514051
H  -1.497657 -2.123629 -1.765324
elementType: S O N C H
totalener: -1797.80077159 hartree
nucrepener: 3101.53485603 hartree
electener: -4899.33562762 hartree
oneelecener: -8632.34364176 hartree
twoeener: 3733.00801414 hartree
cpcmener: -0.04275523 hartree
kineticenergy: 1791.36474741 hartree
xcener: -147.480895947304 hartree
chargesum: -0.0000000
charge: 0.891792 -0.494228 -0.494448 -0.282018 -0.465299 -0.475081 -0.297272 -0.300594 0.187916 -0.205006 -0.318975 -0.134750 -0.415960 -0.422744 -0.114571 -0.061516 -0.059022 -0.149900 0.514204 0.370752 0.037852 0.361314 -0.255564 0.422752 0.420918 -0.324972 -0.124992 -0.114719 0.164865 0.226632 0.125780 0.131838 0.115691 0.099261 0.099549 0.089813 0.090103 0.092354 0.146641 0.101918 0.140804 0.122849 0.114994 0.132883 0.114013 0.194141
qa: 0.8918 -0.4942 -0.4944 -0.2820 -0.4653 -0.4751 -0.2973 -0.3006 0.1879 -0.2050 -0.3190 -0.1347 -0.4160 -0.4227 -0.1146 -0.0615 -0.0590 -0.1499 0.5142 0.3708 0.0379 0.3613 -0.2556 0.4228 0.4209 -0.3250 -0.1250 -0.1147 0.1649 0.2266 0.1258 0.1318 0.1157 0.0993 0.0995 0.0898 0.0901 0.0924 0.1466 0.1019 0.1408 0.1228 0.1150 0.1329 0.1140 0.1941
va: 5.8712 1.9979 2.0043 2.1484 2.0203 2.0312 2.1283 2.1207 3.3721 3.0873 2.9023 3.1900 2.9638 2.9684 4.0719 3.6909 4.1048 3.8486 4.0789 4.3979 3.8389 4.2528 3.9741 3.9812 4.0145 3.9443 3.8401 3.8453 1.0080 1.0528 1.0006 0.9928 1.0102 0.9962 0.9955 1.0027 1.0022 1.0062 1.0160 1.0009 0.9951 0.9901 0.9951 0.9932 0.9956 1.0155
dispcorr: -0.025693369 hartree
energy: -1797.826464960705
dipole: -6.19830 4.19950 -1.99881 15.81549 -13.99082 1.82467 -7.82354 6.15486 -1.66868
magnitude: 3.17949 au
magnitude: 8.08161 debye
