program: Orca
programVersion: 4.2.1
elementType: S O O O O O O O N N N N N N C C C C C C C C C C C C C C H H H H H H H H H H H H H H H H H H
charge: 0
multiplicity: 1
keywords: wb97x-d3
keywords: def2-TZVPP
keywords: def2/J RIJCOSX GRIDX6 NOFINALGRIDX
keywords: grid4 nofinalgrid
keywords: scfconv7
keywords: smallprint printgap noloewdin
keywords: NOSOSCF
formula: C14H18N6O7S
InChI: InChI=1S/C14H18N6O7S/c1-5-27-12(21)8-7-15-20(2)11(8)28(23,24)19-14(22)18-13-16-9(25-3)6-10(17-13)26-4/h6-7,18-19H,5H2,1-4H3
46 atoms
S  1.86263 -0.943995 -1.521721
O  2.365326 -2.203931 -2.018646
O  1.910696 0.221371 -2.374609
O  1.801244 2.57371 1.589916
O  0.688981 1.69115 -0.13986
O  0.668377 -2.783647 0.390173
O  -2.932678 1.685153 -2.166111
O  -5.524073 -0.140736 1.221653
N  3.655756 -1.331338 0.543008
N  0.275684 -1.105751 -1.08558
N  4.128392 -0.779516 1.651856
N  -1.385727 -1.849436 0.360984
N  -2.13744 -0.071057 -0.933613
N  -3.453891 -1.009196 0.786477
C  2.681979 -0.578674 -0.001706
C  2.52237 0.535149 0.811943
C  3.460829 0.340416 1.830148
C  4.209395 -2.607785 0.122777
C  1.572261 1.641458 0.682152
C  -0.096302 -1.968498 -0.084735
C  0.929684 3.719952 1.612564
C  -2.364842 -0.92751 0.045929
C  1.388701 4.621561 2.728439
C  -3.102297 0.806307 -1.193603
C  -4.405889 -0.126554 0.516379
C  -4.290033 0.831183 -0.483633
C  -1.722999 1.660392 -2.922403
C  -5.681652 -1.110525 2.255352
H  3.668415 0.969315 2.680398
H  -0.38751 -0.359954 -1.342589
H  4.714066 -2.520367 -0.834317
H  3.433588 -3.364203 0.068169
H  4.932795 -2.894128 0.87756
H  -0.098907 3.391739 1.771861
H  0.978921 4.232277 0.650317
H  0.740257 5.496432 2.764799
H  1.332479 4.125327 3.697234
H  2.409357 4.970297 2.571808
H  -5.07355 1.543911 -0.694695
H  -0.857324 1.886277 -2.300537
H  -1.581521 0.703956 -3.425817
H  -1.830429 2.439444 -3.671716
H  -6.657792 -0.916358 2.690708
H  -5.66143 -2.125939 1.861107
H  -4.919059 -1.006683 3.026306
H  -1.62415 -2.488215 1.108502
elementType: S O N C H
totalener: -1797.80162653 hartree
nucrepener: 3083.71886586 hartree
electener: -4881.52049239 hartree
oneelecener: -8596.78496381 hartree
twoeener: 3715.26447142 hartree
cpcmener: -0.04287865 hartree
kineticenergy: 1791.35303949 hartree
xcener: -147.479187962632 hartree
chargesum: -0.0000000
charge: 0.888676 -0.494147 -0.495025 -0.281295 -0.470899 -0.477419 -0.297604 -0.300927 0.187068 -0.201915 -0.318856 -0.133036 -0.420647 -0.425676 -0.112469 -0.061372 -0.059146 -0.149764 0.517839 0.374194 0.037111 0.368996 -0.255301 0.423263 0.421451 -0.327954 -0.128188 -0.113739 0.164881 0.227788 0.131962 0.125483 0.115573 0.100567 0.099719 0.092610 0.089433 0.089595 0.147048 0.107843 0.118109 0.141220 0.132844 0.114413 0.114044 0.193648
qa: 0.8887 -0.4941 -0.4950 -0.2813 -0.4709 -0.4774 -0.2976 -0.3009 0.1871 -0.2019 -0.3189 -0.1330 -0.4206 -0.4257 -0.1125 -0.0614 -0.0591 -0.1498 0.5178 0.3742 0.0371 0.3690 -0.2553 0.4233 0.4215 -0.3280 -0.1282 -0.1137 0.1649 0.2278 0.1320 0.1255 0.1156 0.1006 0.0997 0.0926 0.0894 0.0896 0.1470 0.1078 0.1181 0.1412 0.1328 0.1144 0.1140 0.1936
va: 5.8749 2.0056 1.9974 2.1490 2.0145 2.0305 2.1292 2.1206 3.3716 3.0914 2.9024 3.1913 2.9656 2.9708 4.0691 3.6967 4.1028 3.8488 4.0737 4.3946 3.8382 4.2479 3.9746 3.9838 4.0167 3.9394 3.8395 3.8453 1.0079 1.0485 0.9926 1.0006 1.0103 0.9960 0.9959 1.0062 1.0025 1.0028 1.0160 1.0007 0.9912 0.9952 0.9934 0.9953 0.9955 1.0161
dispcorr: -0.025307632 hartree
energy: -1797.826934162970
dipole: -5.86347 3.85114 -2.01234 13.35892 -12.04226 1.31667 10.93208 -9.00390 1.92817
magnitude: 3.08236 au
magnitude: 7.83474 debye
