program: Gaussian 09
title: 000069140
version: EM64L-G09RevD.01
frameworkgroup: C1[X(C9H6ClN)]
method: RPBEPBE
basis: SDD
operation: Freq
keyword: #p
keyword: freq=noraman
keyword: PBEPBE/SDD
title: #p freq=noraman PBEPBE/SDD
converged: NO NO NO YES
title: Mulliken charges:
elementType: Cl N C C C C C C C C C H H H H H H
charge: -0.042916 -0.023330 0.427120 -0.054850 -0.348213 -0.174134 -0.290956 -0.234614 -0.218580 -0.173198 -0.356607 0.254135 0.265219 0.233968 0.235716 0.255487 0.245751
chargesum: 0.00000
title: Mulliken charges with hydrogens summed into heavy atoms:
elementType: Cl N C C C C C C C C C
charge: -0.042916 -0.023330 0.427120 -0.054850 -0.094078 -0.174134 -0.025737 -0.000646 0.017137 0.082289 -0.110856
polarizability: 1.52900974e+02 -1.14614941e+01 1.35546323e+02 1.22467037e-03 1.11567637e-03 4.24333565e+01
1716.lowfreq: -10.8622 -0.0019 0.0014 0.0019 5.3759 10.8842 112.6889 174.0492 199.5694
frequency: 112.6699 174.0474 199.5693 227.0825 363.6579 414.4196 430.9013 468.0081 512.2053 531.2655 563.8358 632.1757 650.6764 776.8224 786.5989 787.8775 804.9167 839.5470 885.0773 943.1161 948.8310 973.7621 1000.3962 1018.5779 1054.8764 1126.6087 1164.2684 1189.3633 1221.0594 1260.7449 1329.6605 1364.9275 1374.3301 1416.6008 1447.6164 1482.6621 1545.4195 1578.2390 1622.4847 3132.9746 3135.0941 3148.2003 3163.7289 3174.8455 3179.5976
redmass: 5.0241 4.3162 9.4254 5.4352 12.9138 3.3156 4.9480 3.1081 7.7235 7.4731 4.3269 3.4797 6.8957 1.3297 3.4650 6.5634 5.6466 1.2554 1.6026 6.4043 1.4243 1.3580 1.3263 2.2505 2.2346 1.7174 1.2013 1.9303 1.9274 1.6250 4.5981 1.9621 2.6571 3.0355 2.5538 3.6215 7.0203 7.2550 6.6979 1.0904 1.0859 1.0896 1.0959 1.0997 1.0956
irintensity: 0.5293 6.7931 1.0024 0.0258 5.0030 9.0328 4.0135 0.5597 0.0451 1.9474 1.3279 0.2055 30.5376 74.1685 3.2619 23.7678 0.1200 58.3651 0.1745 22.7235 0.1381 3.2941 0.0138 5.6892 5.7622 0.6467 9.0300 10.6754 4.6112 5.8861 5.6736 36.3265 13.6913 29.0000 1.1808 64.4901 25.7824 30.9808 6.0276 20.7348 3.2000 6.2601 12.8085 18.6191 2.4783
temp: 298.150 k
press: 1.00000 atm
elementType: 17 7 6 6 6 6 6 6 6 6 6 1 1 1 1 1 1
symmnumber: 1
zpe: 323944.8 jmol-1
zpe.correction: 0.123384 hartree
zpe.thermalcorrener: 0.131485 hartree
zpe.thermalcorrenthalpy: 0.132429 hartree
zpe.thermalcorrgfe: 0.089888 hartree
zpe.sumelectzpe: -860.620926 hartree
zpe.sumelectthermal: -860.612825 hartree
zpe.sumelectthermalent: -860.611881 hartree
zpe.sumelectthermalfe: -860.654421 hartree
dipole: 0.2987 -0.8972 0.0000
dipole: 0.9456
quadrupole: -62.4595 -67.1884 -74.0664
quadrupole: -8.3982 0.0000 0.0000
quadrupole: 5.4452 0.7164 -6.1616 -8.3982 0.0000 0.0000
hfenergy: -860.7443098 hartree
pointgroup: C01 [X(C9H6Cl1N1)]
dipole: -0.2424508 -0.2821799 -0.000012 debye
dipolederiv: -0.248456 0.2312442 -0.0000058 0.3488158 -0.7226924 0.0000152 -0.0000051 0.0000087 -0.0628145 -0.4228713 0.0414824 -0.0000021 0.0463496 -0.3651047 0.0000044 0.0000043 -0.0000002 -0.2331731 -0.2162995 0.1442033 -0.0000041 0.3602564 -0.3718756 0.0000118 -0.0000053 0.0000084 0.0934096 0.2977192 0.1909696 -0.0000007 -0.1728796 0.12094 -0.0000034 -0.0000014 0.0000005 0.0453481 -0.0465174 -0.0778394 0.0000026 0.0139866 0.0457632 -0.000002 -0.0000017 -0.0000025 -0.1537241 0.5358221 -0.2761397 0.0000084 -0.527092 1.1404551 -0.0000278 0.0000126 -0.0000191 -0.0592394 -0.0984758 -0.0905792 0.0000008 -0.0685697 0.0793743 -0.0000021 -0.0000021 -0.0000013 -0.1404954 -0.0336418 0.1334365 -0.0000017 0.11539 0.1048153 -0.0000017 -0.0000053 -0.0000041 -0.1414106 0.1337592 -0.0964823 0.0000069 -0.1126196 -0.0219707 -0.0000033 0.0000141 -0.0000045 -0.1497174 -0.1204771 -0.041762 0.0000011 -0.0520794 -0.5832911 0.0000094 0.0000014 0.0000102 -0.0716926 0.2551091 -0.123858 -0.0000005 0.1072306 0.4909934 -0.0000138 -0.0000005 -0.0000103 -0.072517 0.0823287 0.0626314 -0.0000015 -0.0007062 -0.0278134 0.000002 -0.0000003 0.0000029 0.1632165 0.0790831 0.0180208 -0.0000004 0.0664984 -0.0351425 0.000002 -0.0000008 0.0000026 0.1599085 -0.0172213 -0.0974224 0.0000001 -0.1071442 -0.0157582 0.0000017 0.0000001 0.0000021 0.1586711 -0.1146949 0.0505932 -0.0000051 0.045504 0.0826845 0.0000015 -0.0000064 0.0000023 0.1603234 -0.0336731 0.0205703 -0.0000005 0.0368729 0.1071976 0.0000024 -0.000001 0.000003 0.1714826 -0.0314931 -0.0890688 0.0000025 -0.0998136 -0.0285749 0.0000035 -0.0000026 0.0000012 0.1324245 unknown
polarizability: 158.4464438|2.0913913|130.0008531|0.000711|-0.0014964|42.4333565 unknown
InChI: InChI=1S/C9H6ClN/c10-8-5-6-11-9-4-2-1-3-7(8)9/h1-6H
charge 0 multiplicity 1
17 atoms
Cl 2.063881 -2.442425 0.000095
N  0.519773 1.963217 0.000008
C  0.0224 -0.492593 0.000039
C  -0.384341 0.907292 0.000013
C  -0.980959 -1.512909 0.000041
C  1.43551 -0.731158 0.000064
C  -1.782077 1.21936 0.000004
C  -2.334844 -1.17066 0.000024
C  -2.738895 0.202743 0.000002
C  2.345676 0.320777 0.000034
C  1.829937 1.658025 -0.000002
H  -0.667934 -2.561919 0.000056
H  -2.057637 2.278296 -0.000004
H  -3.096171 -1.958173 0.000031
H  -3.805294 0.453304 -0.000022
H  3.424071 0.143731 0.000038
H  2.529304 2.502192 -0.000019
