program: Orca
programVersion: 4.2.1
elementType: S O O O O O O O N N N N N N C C C C C C C C C C C C C C H H H H H H H H H H H H H H H H H H
charge: 0
multiplicity: 1
keywords: wb97x-d3
keywords: def2-TZVPP
keywords: def2/J RIJCOSX GRIDX6 NOFINALGRIDX
keywords: grid4 nofinalgrid
keywords: scfconv7
keywords: smallprint printgap noloewdin
keywords: NOSOSCF
formula: C14H18N6O7S
InChI: InChI=1S/C14H18N6O7S/c1-5-27-12(21)8-7-15-20(2)11(8)28(23,24)19-14(22)18-13-16-9(25-3)6-10(17-13)26-4/h6-7,18-19H,5H2,1-4H3
46 atoms
S  1.760499 -0.909073 -1.436679
O  2.183538 -2.186728 -1.960493
O  1.792502 0.256895 -2.289478
O  2.279766 2.783575 1.360273
O  0.790739 1.789387 0.016782
O  0.588359 -2.759036 0.491003
O  -3.063496 1.729404 -1.969073
O  -5.81867 -0.563517 0.975982
N  3.646032 -1.367555 0.531964
N  0.199636 -1.013762 -0.904171
N  4.247275 -0.799218 1.566882
N  -1.486279 -1.873757 0.442919
N  -2.246531 -0.051583 -0.786216
N  -3.647794 -1.228337 0.705398
C  2.696854 -0.564289 0.015952
C  2.695511 0.602373 0.767719
C  3.693508 0.385086 1.722026
C  4.074314 -2.698132 0.135143
C  1.815893 1.767905 0.654836
C  -0.1802 -1.936232 0.0357
C  1.497576 3.992778 1.394825
C  -2.500157 -1.00384 0.093697
C  2.262587 5.00919 2.201518
C  -3.253855 0.762595 -1.088394
C  -4.639973 -0.404121 0.398326
C  -4.506545 0.635419 -0.513671
C  -1.781333 1.873694 -2.577706
C  -5.993535 -1.62278 1.914613
H  4.014031 1.037499 2.517807
H  -0.463745 -0.263772 -1.143671
H  4.775196 -3.036459 0.889793
H  4.57623 -2.675575 -0.827743
H  3.232556 -3.380602 0.100705
H  0.526634 3.781787 1.846417
H  1.330121 4.348342 0.376921
H  3.225997 5.240419 1.747253
H  1.685524 5.932349 2.245135
H  2.429261 4.672219 3.224594
H  -5.323192 1.298513 -0.758259
H  -1.013706 2.1115 -1.842464
H  -1.49861 0.982308 -3.137884
H  -1.877767 2.706236 -3.268843
H  -5.830896 -2.597824 1.456762
H  -5.333514 -1.51272 2.774324
H  -7.025742 -1.551822 2.245655
H  -1.7381 -2.568768 1.133579
elementType: S O N C H
totalener: -1797.80264835 hartree
nucrepener: 3055.15931634 hartree
electener: -4852.96196469 hartree
oneelecener: -8539.75456710 hartree
twoeener: 3686.79260241 hartree
cpcmener: -0.04256873 hartree
kineticenergy: 1791.35366443 hartree
xcener: -147.479850599064 hartree
chargesum: -0.0000000
charge: 0.881392 -0.492841 -0.495533 -0.280902 -0.473783 -0.485666 -0.298745 -0.300925 0.187089 -0.195021 -0.319243 -0.132713 -0.428336 -0.427473 -0.099125 -0.070290 -0.058311 -0.152233 0.513678 0.386782 0.038459 0.374596 -0.254299 0.423282 0.419744 -0.326046 -0.130633 -0.114390 0.165660 0.227823 0.115807 0.133264 0.125818 0.103067 0.098158 0.089764 0.091795 0.090024 0.147455 0.113497 0.114129 0.140775 0.113978 0.114387 0.132995 0.193089
qa: 0.8814 -0.4928 -0.4955 -0.2809 -0.4738 -0.4857 -0.2987 -0.3009 0.1871 -0.1950 -0.3192 -0.1327 -0.4283 -0.4275 -0.0991 -0.0703 -0.0583 -0.1522 0.5137 0.3868 0.0385 0.3746 -0.2543 0.4233 0.4197 -0.3260 -0.1306 -0.1144 0.1657 0.2278 0.1158 0.1333 0.1258 0.1031 0.0982 0.0898 0.0918 0.0900 0.1475 0.1135 0.1141 0.1408 0.1140 0.1144 0.1330 0.1931
va: 5.8837 2.0072 1.9991 2.1499 2.0165 2.0249 2.1292 2.1206 3.3704 3.0988 2.9001 3.1909 2.9693 2.9686 4.0498 3.7237 4.0991 3.8492 4.0799 4.3856 3.8355 4.2422 3.9732 3.9877 4.0178 3.9342 3.8393 3.8455 1.0074 1.0443 1.0098 0.9913 1.0016 0.9962 0.9957 1.0028 1.0063 1.0022 1.0159 1.0009 0.9933 0.9952 0.9955 0.9955 0.9934 1.0166
dispcorr: -0.024771389 hartree
energy: -1797.827419734779
dipole: -3.80703 2.01762 -1.78941 13.82787 -12.51137 1.31650 9.26211 -7.50896 1.75315
magnitude: 2.82997 au
magnitude: 7.19321 debye
