program: Orca
programVersion: 4.2.1
elementType: S O O O O O O O N N N N N N C C C C C C C C C C C C C C H H H H H H H H H H H H H H H H H H
charge: 0
multiplicity: 1
keywords: wb97x-d3
keywords: def2-TZVPP
keywords: def2/J RIJCOSX GRIDX6 NOFINALGRIDX
keywords: grid4 nofinalgrid
keywords: scfconv7
keywords: smallprint printgap noloewdin
keywords: NOSOSCF
formula: C14H18N6O7S
InChI: InChI=1S/C14H18N6O7S/c1-5-27-12(21)8-7-15-20(2)11(8)28(23,24)19-14(22)18-13-16-9(25-3)6-10(17-13)26-4/h6-7,18-19H,5H2,1-4H3
46 atoms
S  1.79918 -0.913601 -1.471896
O  2.259072 -2.17785 -1.999281
O  1.835392 0.260647 -2.313673
O  2.108894 2.718444 1.452014
O  0.740115 1.745497 -0.026568
O  0.619481 -2.784085 0.430603
O  -2.997772 1.730581 -2.01789
O  -5.713168 -0.421048 1.068874
N  3.63449 -1.363517 0.542884
N  0.227414 -1.052639 -0.982538
N  4.183161 -0.808178 1.613887
N  -1.449668 -1.884352 0.392379
N  -2.198709 -0.059764 -0.838176
N  -3.578787 -1.164952 0.725681
C  2.68429 -0.570768 0.01343
C  2.624432 0.575029 0.794991
C  3.592689 0.356722 1.779454
C  4.104661 -2.677224 0.133385
C  1.721437 1.722114 0.677103
C  -0.147998 -1.961466 -0.026697
C  1.293242 3.906285 1.476562
C  -2.448453 -0.987852 0.068427
C  1.977892 4.915914 2.359446
C  -3.187954 0.785211 -1.114166
C  -4.553427 -0.311509 0.443507
C  -4.420247 0.710262 -0.4887
C  -1.735525 1.817214 -2.678577
C  -5.886294 -1.456949 2.034193
H  3.868417 0.995688 2.602388
H  -0.439752 -0.304182 -1.221448
H  4.620779 -2.62699 -0.820549
H  3.280909 -3.380084 0.07628
H  4.801461 -3.00736 0.89531
H  0.303028 3.655537 1.860969
H  1.177925 4.290202 0.461955
H  2.091555 4.551671 3.380256
H  2.959494 5.189287 1.972842
H  1.371092 5.8202 2.395018
H  -5.22293 1.397566 -0.711344
H  -0.932014 2.039017 -1.977664
H  -1.507092 0.906555 -3.232411
H  -1.828785 2.641226 -3.380214
H  -5.785272 -2.445093 1.586892
H  -5.182775 -1.36026 2.860193
H  -6.898107 -1.337682 2.411075
H  -1.696371 -2.565646 1.098391
elementType: S O N C H
totalener: -1797.80240332 hartree
nucrepener: 3066.44483188 hartree
electener: -4864.24723520 hartree
oneelecener: -8562.29798467 hartree
twoeener: 3698.05074948 hartree
cpcmener: -0.04260218 hartree
kineticenergy: 1791.35310851 hartree
xcener: -147.479773609189 hartree
chargesum: 0.0000000
charge: 0.883727 -0.494686 -0.495159 -0.281495 -0.473584 -0.482389 -0.298460 -0.300982 0.188375 -0.197602 -0.319145 -0.132713 -0.424898 -0.427109 -0.103760 -0.068846 -0.058182 -0.153274 0.516762 0.382131 0.038262 0.372422 -0.254006 0.423747 0.421217 -0.327892 -0.131221 -0.114127 0.165393 0.227758 0.134384 0.125843 0.115679 0.103291 0.097554 0.090048 0.089448 0.091958 0.147320 0.113273 0.115453 0.140879 0.114222 0.114238 0.133001 0.193145
qa: 0.8837 -0.4947 -0.4952 -0.2815 -0.4736 -0.4824 -0.2985 -0.3010 0.1884 -0.1976 -0.3191 -0.1327 -0.4249 -0.4271 -0.1038 -0.0688 -0.0582 -0.1533 0.5168 0.3821 0.0383 0.3724 -0.2540 0.4237 0.4212 -0.3279 -0.1312 -0.1141 0.1654 0.2278 0.1344 0.1258 0.1157 0.1033 0.0976 0.0900 0.0894 0.0920 0.1473 0.1133 0.1155 0.1409 0.1142 0.1142 0.1330 0.1931
va: 5.8809 2.0049 1.9993 2.1510 2.0153 2.0276 2.1297 2.1208 3.3698 3.0943 2.9006 3.1910 2.9690 2.9700 4.0546 3.7178 4.1000 3.8480 4.0756 4.3887 3.8357 4.2449 3.9735 3.9858 4.0171 3.9360 3.8376 3.8453 1.0075 1.0473 0.9912 1.0016 1.0100 0.9960 0.9963 1.0021 1.0029 1.0062 1.0160 1.0007 0.9926 0.9952 0.9954 0.9956 0.9933 1.0165
dispcorr: -0.025002080 hartree
energy: -1797.827405401319
dipole: -4.48933 2.61857 -1.87076 13.75038 -12.43096 1.31942 9.83907 -8.01126 1.82781
magnitude: 2.92942 au
magnitude: 7.44599 debye
