program: Orca
programVersion: 4.2.1
elementType: S O O O O O O O N N N N N N C C C C C C C C C C C C C C H H H H H H H H H H H H H H H H H H
charge: 0
multiplicity: 1
keywords: wb97x-d3
keywords: def2-TZVPP
keywords: def2/J RIJCOSX GRIDX6 NOFINALGRIDX
keywords: grid4 nofinalgrid
keywords: scfconv7
keywords: smallprint printgap noloewdin
keywords: NOSOSCF
formula: C14H18N6O7S
InChI: InChI=1S/C14H18N6O7S/c1-5-27-12(21)8-7-15-20(2)11(8)28(23,24)19-14(22)18-13-16-9(25-3)6-10(17-13)26-4/h6-7,18-19H,5H2,1-4H3
46 atoms
S  1.788725 -0.897117 -1.482594
O  2.256664 -2.15393 -2.018938
O  1.819284 0.280351 -2.319285
O  2.084058 2.71789 1.470044
O  0.730454 1.756237 -0.03035
O  0.623239 -2.772873 0.425299
O  -3.002571 1.72481 -2.026712
O  -5.712113 -0.416182 1.073117
N  3.615876 -1.358151 0.538038
N  0.217454 -1.047738 -0.992241
N  4.162717 -0.809003 1.613016
N  -1.452204 -1.887359 0.385181
N  -2.204815 -0.065036 -0.846219
N  -3.580189 -1.164502 0.725036
C  2.669876 -0.56074 0.008624
C  2.610567 0.582094 0.79486
C  3.575203 0.357021 1.781563
C  4.075279 -2.67391 0.127188
C  1.706142 1.727609 0.680819
C  -0.149757 -1.956752 -0.034756
C  1.263678 3.901615 1.49999
C  -2.451835 -0.990682 0.063788
C  1.938993 4.90686 2.396267
C  -3.19281 0.781925 -1.120588
C  -4.554115 -0.309396 0.444251
C  -4.422419 0.711032 -0.489704
C  -1.745377 1.798913 -2.697748
C  -5.883907 -1.450576 2.039461
H  3.850025 0.99195 2.608022
H  -0.459941 -0.307959 -1.234393
H  4.597407 -2.626345 -0.823662
H  3.244634 -3.367867 0.061986
H  4.763584 -3.015861 0.891548
H  0.271996 3.643894 1.876259
H  1.152384 4.295012 0.488366
H  1.326395 5.806922 2.440103
H  2.052361 4.531766 3.413348
H  2.920014 5.190457 2.015375
H  -5.2241 1.400583 -0.709305
H  -0.933363 2.013368 -2.004342
H  -1.530947 0.885523 -3.252993
H  -1.835809 2.623168 -3.399463
H  -6.8917 -1.325232 2.425034
H  -5.793041 -2.439351 1.590988
H  -5.172905 -1.359397 2.859729
H  -1.697452 -2.566397 1.093884
elementType: S O N C H
totalener: -1797.80241436 hartree
nucrepener: 3067.99638349 hartree
electener: -4865.79879785 hartree
oneelecener: -8565.39638550 hartree
twoeener: 3699.59758765 hartree
cpcmener: -0.04263797 hartree
kineticenergy: 1791.35430085 hartree
xcener: -147.480308140035 hartree
chargesum: 0.0000000
charge: 0.884615 -0.494663 -0.494580 -0.281924 -0.474413 -0.483727 -0.298127 -0.300716 0.189359 -0.198376 -0.319374 -0.132939 -0.423912 -0.426784 -0.105164 -0.068531 -0.057716 -0.154518 0.517484 0.383111 0.037926 0.371908 -0.254076 0.424074 0.421635 -0.327643 -0.130353 -0.113939 0.165441 0.226837 0.134280 0.126796 0.115451 0.103274 0.097266 0.091979 0.089941 0.089461 0.147352 0.111738 0.116230 0.140866 0.132921 0.114296 0.113945 0.193291
qa: 0.8846 -0.4947 -0.4946 -0.2819 -0.4744 -0.4837 -0.2981 -0.3007 0.1894 -0.1984 -0.3194 -0.1329 -0.4239 -0.4268 -0.1052 -0.0685 -0.0577 -0.1545 0.5175 0.3831 0.0379 0.3719 -0.2541 0.4241 0.4216 -0.3276 -0.1304 -0.1139 0.1654 0.2268 0.1343 0.1268 0.1155 0.1033 0.0973 0.0920 0.0899 0.0895 0.1474 0.1117 0.1162 0.1409 0.1329 0.1143 0.1139 0.1933
va: 5.8800 2.0050 2.0003 2.1504 2.0137 2.0263 2.1303 2.1210 3.3689 3.0925 2.9005 3.1910 2.9704 2.9699 4.0551 3.7178 4.0999 3.8476 4.0752 4.3868 3.8360 4.2454 3.9733 3.9847 4.0166 3.9364 3.8378 3.8454 1.0074 1.0501 0.9911 1.0018 1.0100 0.9959 0.9965 1.0062 1.0022 1.0029 1.0159 1.0004 0.9924 0.9954 0.9933 0.9953 0.9957 1.0163
dispcorr: -0.025040615 hartree
energy: -1797.827454974358
dipole: -4.62614 2.71607 -1.91007 13.60858 -12.32962 1.27896 9.94802 -8.11815 1.82987
magnitude: 2.93812 au
magnitude: 7.46810 debye
