program: Gaussian 09
title: 000069139
version: EM64L-G09RevD.01
frameworkgroup: C1[X(C9H6ClN)]
method: RPBEPBE
basis: SDD
operation: Freq
keyword: #p
keyword: freq=noraman
keyword: PBEPBE/SDD
title: #p freq=noraman PBEPBE/SDD
converged: NO YES YES YES
title: Mulliken charges:
elementType: Cl N C C C C C C C C C H H H H H H
charge: -0.014170 0.007095 0.431250 0.049470 -0.405737 -0.305287 -0.215640 -0.233493 -0.237111 -0.175270 -0.359319 0.238279 0.246177 0.236054 0.258560 0.233253 0.245890
chargesum: 0.00000
title: Mulliken charges with hydrogens summed into heavy atoms:
elementType: Cl N C C C C C C C C C
charge: -0.014170 0.007095 0.431250 0.049470 -0.167458 -0.059110 -0.215640 0.002561 0.021448 0.057983 -0.113429
polarizability: 1.51801314e+02 1.05876540e+01 1.37662333e+02 -6.22901036e-05 8.26448581e-05 4.21650431e+01
1716.lowfreq: -10.9197 -0.0008 0.0007 0.0023 6.6100 10.2839 108.9343 174.3231 193.7125
frequency: 108.9269 174.3214 193.7094 227.3031 373.4938 412.5797 423.2064 468.2234 519.3360 532.8929 546.8589 632.5840 640.0958 763.9059 793.9184 801.1002 815.6922 838.0188 903.0992 943.8500 948.6377 976.0264 990.8267 1028.1182 1063.5128 1124.4523 1160.4691 1197.2239 1225.7761 1239.5270 1340.0893 1367.7417 1387.9408 1422.2218 1440.2873 1489.3815 1543.9333 1590.1576 1615.6414 3125.8120 3129.3318 3132.7084 3153.4638 3167.6779 3172.7545
redmass: 6.0392 4.2132 11.0947 4.2118 11.1092 4.1218 4.8191 3.1559 7.2282 7.7433 3.8918 3.2318 7.7562 1.2623 5.6714 2.0002 6.5308 2.2035 1.3840 1.4347 6.5017 1.3436 1.3879 2.6694 2.0939 1.7041 1.2496 1.6219 2.0244 1.7699 5.3864 1.9006 2.4031 2.8763 2.5631 3.7943 7.3968 5.7291 7.0934 1.0884 1.0883 1.0911 1.0928 1.0992 1.0978
irintensity: 1.3723 5.8115 0.9329 2.1913 3.0356 0.5592 2.4539 0.2592 0.1003 1.3804 1.9638 0.0075 21.1695 19.1504 7.2891 61.5758 9.5404 56.4228 0.9887 0.1487 46.8144 0.6325 1.8447 0.6235 8.6648 0.9633 3.4538 16.0216 2.1215 4.6959 5.6182 36.9995 5.9637 0.4522 23.8414 31.0349 14.2896 7.9663 2.2518 10.5840 1.9332 15.7077 16.0008 28.3163 8.5036
temp: 298.150 k
press: 1.00000 atm
elementType: 17 7 6 6 6 6 6 6 6 6 6 1 1 1 1 1 1
symmnumber: 1
zpe: 323870.0 jmol-1
zpe.correction: 0.123356 hartree
zpe.thermalcorrener: 0.131469 hartree
zpe.thermalcorrenthalpy: 0.132414 hartree
zpe.thermalcorrgfe: 0.089836 hartree
zpe.sumelectzpe: -860.617079 hartree
zpe.sumelectthermal: -860.608965 hartree
zpe.sumelectthermalent: -860.608021 hartree
zpe.sumelectthermalfe: -860.650598 hartree
dipole: -2.7058 3.1713 0.0000
dipole: 4.1688
quadrupole: -59.3849 -64.6576 -74.0489
quadrupole: 5.0182 0.0000 0.0000
quadrupole: 6.6456 1.3729 -8.0184 5.0182 0.0000 0.0000
hfenergy: -860.7404343 hartree
pointgroup: C01 [X(C9H6Cl1N1)]
dipole: -0.4670748 1.5722219 0.0000057 debye
dipolederiv: -0.1813378 0.2321279 0. 0.3154002 -0.6913985 -0.0000011 -0.0000005 -0.0000006 -0.0463518 -0.3811393 -0.0387464 0. 0.0241714 -0.2734307 -0.0000007 0.0000016 0.0000004 -0.2202814 -0.0875157 0.0562615 0.0000008 0.2042207 -0.0906113 -0.0000002 0.0000015 0. 0.0937503 0.2161327 0.2225503 -0.0000003 0.0260655 -0.2159379 -0.0000012 -0.0000016 -0.0000011 0.0604507 -0.0898527 -0.0283118 -0.0000007 -0.0071248 0.0685955 0.0000026 0.0000009 0.0000037 -0.1838595 0.1523021 0.0129551 -0.0000009 -0.053105 0.1712219 0.0000005 -0.0000015 0. -0.1409934 0.2091747 -0.3472968 0. -0.5272336 1.0833166 0.0000023 -0.000001 0.0000011 -0.0692588 0.0312338 0.0298821 0.0000004 0.0489969 0.1666216 -0.0000005 -0.0000005 -0.0000004 -0.1460991 0.0000326 -0.077897 0.000001 0.0138162 -0.3312385 -0.0000002 0.0000008 -0.0000008 -0.1129536 0.0238936 -0.0847736 -0.0000007 -0.1992516 -0.2515645 0.0000002 -0.0000007 0.0000005 -0.1090039 0.1887686 0.0385559 -0.0000005 0.1821093 0.3908448 -0.0000003 -0.0000007 0. -0.0582006 0.056486 0.0843891 0.0000007 0.0143055 -0.0894428 -0.0000013 0. -0.000002 0.1659155 0.0716812 0.0159907 0. 0.07671 -0.0805787 -0.0000004 0.0000007 -0.0000006 0.1452226 -0.0130705 -0.099309 -0.0000002 -0.0928108 -0.0230561 -0.0000002 -0.0000011 -0.0000006 0.1626228 -0.0375239 0.0377242 -0.0000004 0.0456102 0.0870342 0.0000003 0.0000005 0.0000003 0.1661353 -0.1143036 0.037598 0.0000006 0.0433344 0.0925427 0. 0.0000005 -0.0000002 0.1649554 -0.0449618 -0.0917002 0.0000001 -0.1152146 -0.0129183 0.0000002 0.0000008 0.0000002 0.1279495 unknown
polarizability: 157.3256196|1.8634419|132.1380277|-0.0000234|0.0001008|42.1650431 unknown
InChI: InChI=1S/C9H6ClN/c10-8-5-1-3-7-4-2-6-11-9(7)8/h1-6H
charge 0 multiplicity 1
17 atoms
Cl 1.913404 -2.487948 0.000002
N  -0.957734 -1.473591 0.000003
C  -0.400468 0.954062 0.000004
C  -0.023087 -0.451121 -0.000003
C  0.607481 1.970647 0.000007
C  -1.802513 1.255092 0.000006
C  1.381909 -0.757033 0.000003
C  1.95778 1.619369 0.000005
C  2.35162 0.245187 0.000007
C  -2.734682 0.217452 0.000007
C  -2.260809 -1.134412 0.000004
H  0.303866 3.024013 0.000014
H  -2.124475 2.303066 0.000008
H  2.733485 2.392069 0.000006
H  3.411889 -0.024612 0.00001
H  -3.810711 0.41671 0.00001
H  -2.973756 -1.967748 0.000005
