program: Orca
programVersion: 4.2.1
elementType: S O O O O O O O N N N N N N C C C C C C C C C C C C C C H H H H H H H H H H H H H H H H H H
charge: 0
multiplicity: 1
keywords: wb97x-d3
keywords: def2-TZVPP
keywords: def2/J RIJCOSX GRIDX6 NOFINALGRIDX
keywords: grid4 nofinalgrid
keywords: scfconv7
keywords: smallprint printgap noloewdin
keywords: NOSOSCF
formula: C14H18N6O7S
InChI: InChI=1S/C14H18N6O7S/c1-5-27-12(21)8-7-15-20(2)11(8)28(23,24)19-14(22)18-13-16-9(25-3)6-10(17-13)26-4/h6-7,18-19H,5H2,1-4H3
46 atoms
S  1.309226 -1.826592 0.857814
O  0.90687 -1.530142 2.2140
O  1.672946 -3.177747 0.498649
O  2.353451 2.580584 1.816951
O  0.59304 1.281373 1.325281
O  1.089368 -1.753512 -2.054604
O  -5.021203 1.047318 -3.020716
O  -3.666223 0.508855 1.382783
N  3.79992 -1.147884 -0.135987
N  0.049998 -1.321007 -0.084953
N  4.659445 -0.14308 -0.217429
N  -0.971506 -0.83659 -2.113318
N  -2.99123 0.0962 -2.569458
N  -2.302347 -0.168518 -0.326512
C  2.644694 -0.757458 0.435472
C  2.777393 0.587207 0.749944
C  4.065627 0.906536 0.312352
C  4.210967 -2.447616 -0.639502
C  1.780753 1.494402 1.326277
C  0.121094 -1.333682 -1.453599
C  1.509668 3.602584 2.382311
C  -2.140371 -0.279702 -1.633208
C  1.062485 3.265019 3.785397
C  -4.1208 0.642626 -2.141044
C  -3.442436 0.378094 0.086831
C  -4.415371 0.816528 -0.794515
C  -4.758405 0.877076 -4.411857
C  -2.67708 0.062686 2.308787
H  4.569706 1.858517 0.349162
H  -0.733877 -0.818223 0.354735
H  4.344712 -3.155734 0.173027
H  5.161783 -2.300679 -1.13908
H  3.49079 -2.830959 -1.353579
H  0.659815 3.788722 1.724857
H  2.133945 4.493666 2.38325
H  1.91351 3.071968 4.438392
H  0.51811 4.117155 4.193383
H  0.397496 2.403076 3.813509
H  -5.339462 1.262441 -0.457348
H  -5.628966 1.276708 -4.92424
H  -3.873528 1.429287 -4.726387
H  -4.64037 -0.173749 -4.673965
H  -2.477883 -1.003936 2.203782
H  -1.750495 0.626439 2.206719
H  -3.095607 0.245429 3.294487
H  -0.896759 -0.871475 -3.121496
elementType: S O N C H
totalener: -1797.80100241 hartree
nucrepener: 3068.48970709 hartree
electener: -4866.29070949 hartree
oneelecener: -8566.43367756 hartree
twoeener: 3700.14296807 hartree
cpcmener: -0.04113993 hartree
kineticenergy: 1791.34666236 hartree
xcener: -147.478914800001 hartree
chargesum: -0.0000000
charge: 0.881579 -0.495732 -0.494223 -0.289497 -0.459595 -0.485459 -0.301142 -0.299754 0.185887 -0.194479 -0.319828 -0.132130 -0.427618 -0.427933 -0.098458 -0.080515 -0.061288 -0.152018 0.507414 0.387283 0.047977 0.372846 -0.259852 0.419507 0.424062 -0.325521 -0.114391 -0.124379 0.167187 0.228413 0.133287 0.115604 0.125569 0.091936 0.112690 0.091345 0.098496 0.088144 0.147343 0.132740 0.114074 0.114200 0.114117 0.108219 0.141422 0.192475
qa: 0.8816 -0.4957 -0.4942 -0.2895 -0.4596 -0.4855 -0.3011 -0.2998 0.1859 -0.1945 -0.3198 -0.1321 -0.4276 -0.4279 -0.0985 -0.0805 -0.0613 -0.1520 0.5074 0.3873 0.0480 0.3728 -0.2599 0.4195 0.4241 -0.3255 -0.1144 -0.1244 0.1672 0.2284 0.1333 0.1156 0.1256 0.0919 0.1127 0.0913 0.0985 0.0881 0.1473 0.1327 0.1141 0.1142 0.1141 0.1082 0.1414 0.1925
va: 5.8825 1.9996 2.0051 2.1435 2.0300 2.0253 2.1203 2.1295 3.3689 3.1005 2.8975 3.1908 2.9680 2.9702 4.0462 3.7148 4.1034 3.8489 4.1056 4.3850 3.8306 4.2428 3.9202 4.0166 3.9850 3.9325 3.8462 3.8436 1.0064 1.0440 0.9914 1.0099 1.0020 1.0115 0.9961 1.0044 1.0063 1.0096 1.0159 0.9935 0.9954 0.9953 0.9942 0.9982 0.9948 1.0170
dispcorr: -0.025333615 hartree
energy: -1797.826336021179
dipole: -4.74739 3.44605 -1.30135 13.31191 -11.01687 2.29505 4.65566 -5.36740 -0.71175
magnitude: 2.73264 au
magnitude: 6.94582 debye
