program: Gaussian 09
title: 000074199
version: EM64L-G09RevD.01
frameworkgroup: C1[X(C10H21NO3Si)]
method: RPBEPBE
basis: SDD
operation: Freq
keyword: #p
keyword: freq=noraman
keyword: PBEPBE/SDD
title: #p freq=noraman PBEPBE/SDD
converged: NO YES NO NO
title: Mulliken charges:
elementType: Si O O O N C C C C C C C C C C H H H H H H H H H H H H H H H H H H H H H
charge: 1.550250 -0.593895 -0.579077 -0.599614 -0.030532 -0.636805 -0.325983 -0.692796 -0.205317 -0.211442 -0.206496 -0.130380 -0.655463 -0.657130 -0.649415 0.282575 0.223774 0.232514 0.206843 0.240503 0.223523 0.194362 0.205492 0.207040 0.216877 0.206676 0.205202 0.200391 0.226196 0.233247 0.204589 0.221869 0.231750 0.202412 0.226778 0.231481
chargesum: 0.00000
title: Mulliken charges with hydrogens summed into heavy atoms:
elementType: Si O O O N C C C C C C C C C C
charge: 1.550250 -0.593895 -0.579077 -0.599614 -0.030532 -0.354229 0.130305 -0.021927 0.194537 0.212475 0.205382 -0.130380 0.004370 0.001079 0.011256
polarizability: 1.51437191e+02 -7.49261433e+00 1.56135958e+02 -2.60888041e+00 2.53659883e+00 1.27546547e+02
1716.lowfreq: -49.2732 -23.3075 -12.5828 -7.5439 -6.0181 0.0012 0.0012 0.0013 16.7962
frequency: -49.1957 -22.0337 15.5605 24.2195 30.6173 39.0186 50.2112 62.1506 70.2937 81.3350 102.4310 122.8675 135.4015 160.2008 207.9488 234.7406 241.8276 245.6807 248.2494 259.4085 263.0209 269.9241 280.3361 312.9791 371.6946 418.0873 426.7074 497.5335 545.0287 610.4065 685.7610 708.0747 736.4062 781.7047 798.9334 802.1103 807.0943 886.1328 934.6459 946.3954 947.8871 951.4922 1037.7907 1050.0527 1055.5358 1074.5535 1077.0041 1100.2147 1101.7525 1102.7102 1106.4357 1132.6302 1133.5065 1140.9430 1177.4248 1237.5191 1256.2138 1266.1361 1267.8673 1300.6547 1331.1911 1357.7526 1360.5628 1366.2076 1391.1320 1391.8827 1392.4522 1394.1234 1456.6857 1456.9116 1457.4989 1471.5237 1472.5561 1475.8240 1477.3677 1477.5048 1484.0142 1487.6608 1489.1542 1490.7341 2175.5216 2949.2991 2964.2392 2965.6114 2978.8049 2984.1072 2990.1259 2991.2805 2992.0767 3000.2946 3006.0062 3021.9944 3024.8620 3050.2941 3078.1385 3084.1664 3087.2901 3089.1181 3089.8034 3103.5688 3104.4204 3105.9726
redmass: 1.7358 3.5916 3.3982 3.3495 2.3680 2.6429 3.2266 2.7983 3.3710 2.4608 4.1645 4.7430 4.1674 3.0494 2.4288 1.3044 2.3460 1.3286 1.2199 2.1060 3.8411 3.3250 2.6697 3.4218 3.5208 5.1403 4.8819 7.6415 4.0960 5.1162 4.5020 5.4243 3.0145 1.4710 1.0910 1.0928 1.0937 2.5124 2.4825 2.2160 2.5222 2.7698 1.7617 4.6007 4.4299 4.4590 3.1847 2.1398 2.1712 2.0976 1.8181 1.4680 1.4600 1.5354 1.3820 1.3097 1.1375 1.1262 1.1257 1.1966 1.3441 1.2506 1.2410 1.2363 1.2530 1.2489 1.2569 1.2078 1.0413 1.0414 1.0411 1.0597 1.0561 1.0482 1.0470 1.0481 1.0622 1.0749 1.0770 1.0818 12.4927 1.0571 1.0564 1.0568 1.0359 1.0798 1.0367 1.0363 1.0362 1.0617 1.1059 1.1069 1.1070 1.1013 1.1002 1.1008 1.0983 1.0986 1.0985 1.1016 1.1016 1.1015
irintensity: 1.8835 0.3519 1.7095 1.6111 0.8436 3.0456 1.0482 2.8876 1.3478 1.4365 5.9092 5.4417 13.7546 1.5203 0.9948 3.2290 3.1261 1.5576 1.7778 7.8788 8.1940 7.6712 1.1861 19.5962 8.4569 3.7255 20.8969 40.9568 2.6184 45.1876 27.1874 71.6115 37.4826 14.3379 2.5874 3.4118 2.8727 9.1576 66.2537 14.2749 64.6262 150.6326 25.0649 449.7702 350.6641 84.1139 15.7769 9.3379 10.3948 3.6572 5.0061 3.6595 8.5816 18.4147 31.6617 7.5924 0.6346 0.7226 1.2858 1.2985 2.1781 15.8772 10.9980 3.5065 30.6725 22.5034 32.6841 17.7110 10.2064 13.7661 9.2766 2.7028 4.7714 7.5511 6.2954 9.3099 14.4642 7.7683 6.9703 2.6051 28.5293 55.6194 68.8482 17.9725 29.6152 1.7880 24.5033 26.7361 22.5057 16.5999 39.8737 43.0882 17.5088 1.6379 42.7797 35.2817 34.7425 36.8817 32.8077 46.2063 30.1487 37.1962
temp: 298.150 k
press: 1.00000 atm
elementType: 14 8 8 8 7 6 6 6 6 6 6 6 6 6 6 1 1 1 1 1 1 1 1 1 1 1 1 1 1 1 1 1 1 1 1 1
symmnumber: 1
zpe: 786264.7 jmol-1
zpe.correction: 0.299472 hartree
zpe.thermalcorrener: 0.319446 hartree
zpe.thermalcorrenthalpy: 0.320390 hartree
zpe.thermalcorrgfe: 0.247260 hartree
zpe.sumelectzpe: -962.304193 hartree
zpe.sumelectthermal: -962.284220 hartree
zpe.sumelectthermalent: -962.283276 hartree
zpe.sumelectthermalfe: -962.356406 hartree
dipole: -0.3892 3.3067 0.2909
dipole: 3.3422
quadrupole: -86.8090 -103.7371 -105.8399
quadrupole: 1.2718 2.7922 -12.4864
quadrupole: 11.9863 -4.9418 -7.0446 1.2718 2.7922 -12.4864
hfenergy: -962.6036658 hartree
pointgroup: C01 [X(C10H21N1O3Si1)]
dipole: -1.1107442 0.6250185 -0.3234142 debye
polarizability: 149.2365756|-5.9736935|156.6297373|4.8471611|-6.6826059|129.2533828 unknown
InChI: InChI=1S/C10H21NO3Si/c1-5-10(9-11)15(12-6-2,13-7-3)14-8-4/h10H,5-8H2,1-4H3
charge 0 multiplicity 1
36 atoms
Si -0.36486 0.147196 -0.134058
O  -1.198846 1.391217 -0.965051
O  0.123125 -0.897545 -1.397352
O  -1.318553 -0.630493 1.060624
N  2.574592 -0.995488 1.985865
C  1.104287 0.913563 0.854442
C  1.968489 1.853128 -0.05125
C  3.038101 2.628891 0.74321
C  -2.241955 2.27158 -0.418339
C  0.991882 -2.086658 -1.275379
C  -2.418954 -1.589258 0.857734
C  1.90889 -0.13188 1.495919
C  -2.726438 3.175367 -1.551744
C  0.865632 -2.885472 -2.571074
C  -2.377207 -2.617003 1.989607
H  0.6405 1.521364 1.659299
H  2.446751 1.252273 -0.847849
H  1.280983 2.556652 -0.55794
H  2.57425 3.267614 1.51828
H  3.740839 1.941027 1.247338
H  3.624443 3.282285 0.072265
H  -1.829942 2.876413 0.416646
H  -3.073899 1.658136 -0.016316
H  0.687054 -2.693751 -0.398442
H  2.036439 -1.75581 -1.113362
H  -2.318745 -2.084316 -0.130094
H  -3.373026 -1.026684 0.869465
H  -3.519555 3.856965 -1.191284
H  -1.891263 3.78049 -1.94417
H  -3.129623 2.566788 -2.378669
H  1.52643 -3.771884 -2.540239
H  -0.174197 -3.223742 -2.720435
H  1.152931 -2.260894 -3.434088
H  -3.215331 -3.332735 1.892758
H  -1.427481 -3.178637 1.968702
H  -2.457443 -2.112698 2.967683
