program: Orca
programVersion: 4.2.1
elementType: S O O O O O O O N N N N N N C C C C C C C C C C C C C C H H H H H H H H H H H H H H H H H H
charge: 0
multiplicity: 1
keywords: wb97x-d3
keywords: def2-TZVPP
keywords: def2/J RIJCOSX GRIDX6 NOFINALGRIDX
keywords: grid4 nofinalgrid
keywords: scfconv7
keywords: smallprint printgap noloewdin
keywords: NOSOSCF
formula: C14H18N6O7S
InChI: InChI=1S/C14H18N6O7S/c1-5-27-12(21)8-7-15-20(2)11(8)28(23,24)19-14(22)18-13-16-9(25-3)6-10(17-13)26-4/h6-7,18-19H,5H2,1-4H3
46 atoms
S  1.932255 -0.871561 -1.535105
O  2.511032 -2.056525 -2.124896
O  1.988908 0.378795 -2.258455
O  1.552125 2.333682 1.870133
O  0.509575 1.50607 0.067956
O  0.688369 -2.921497 0.12278
O  -2.769551 1.85795 -2.017012
O  -5.280327 -0.00581 1.410877
N  3.618885 -1.396048 0.587778
N  0.32861 -1.129507 -1.223114
N  4.014227 -0.930183 1.764069
N  -1.350984 -1.953444 0.156496
N  -2.057392 -0.053963 -0.980566
N  -3.319655 -0.996745 0.776219
C  2.644043 -0.632017 0.061594
C  2.398999 0.39745 0.961024
C  3.295316 0.145917 2.004493
C  4.237562 -2.612696 0.087213
C  1.389789 1.457807 0.891522
C  -0.060948 -2.060469 -0.29147
C  0.602899 3.411635 1.983552
C  -2.279328 -0.94701 -0.033975
C  0.876221 4.528095 1.004132
C  -2.950969 0.922718 -1.100892
C  -4.212371 -0.026765 0.631739
C  -4.07994 0.992496 -0.303286
C  -1.614952 1.798355 -2.85343
C  -5.441799 -1.024979 2.395523
H  3.433786 0.700326 2.918204
H  -0.334173 -0.3641 -1.422198
H  4.810666 -2.419369 -0.814373
H  3.488658 -3.374067 -0.102516
H  4.908402 -2.960756 0.864202
H  0.720416 3.762515 3.006661
H  -0.410983 3.02466 1.875213
H  0.699789 4.228608 -0.027662
H  0.206851 5.359316 1.227732
H  1.898931 4.894354 1.093468
H  -4.809576 1.782336 -0.404014
H  -1.578213 0.872526 -3.427191
H  -1.70695 2.635716 -3.539184
H  -0.697475 1.913329 -2.277023
H  -5.539622 -2.010676 1.941947
H  -4.616232 -1.034179 3.106076
H  -6.361289 -0.780635 2.91977
H  -1.597143 -2.633033 0.86434
elementType: S O N C H
totalener: -1797.79886529 hartree
nucrepener: 3122.82167803 hartree
electener: -4920.62054332 hartree
oneelecener: -8674.93985275 hartree
twoeener: 3754.31930943 hartree
cpcmener: -0.04096418 hartree
kineticenergy: 1791.36291872 hartree
xcener: -147.480658165739 hartree
chargesum: -0.0000000
charge: 0.891197 -0.494573 -0.496161 -0.291900 -0.448974 -0.473825 -0.297859 -0.301169 0.187457 -0.201755 -0.319428 -0.135281 -0.411805 -0.421153 -0.118082 -0.069326 -0.060506 -0.149522 0.507350 0.366594 0.049867 0.357241 -0.263269 0.425890 0.422585 -0.328306 -0.121836 -0.113606 0.165359 0.224022 0.132504 0.125131 0.115321 0.113123 0.090364 0.091837 0.098825 0.088937 0.146201 0.122437 0.141346 0.100172 0.114602 0.113589 0.132724 0.193659
qa: 0.8912 -0.4946 -0.4962 -0.2919 -0.4490 -0.4738 -0.2979 -0.3012 0.1875 -0.2018 -0.3194 -0.1353 -0.4118 -0.4212 -0.1181 -0.0693 -0.0605 -0.1495 0.5073 0.3666 0.0499 0.3572 -0.2633 0.4259 0.4226 -0.3283 -0.1218 -0.1136 0.1654 0.2240 0.1325 0.1251 0.1153 0.1131 0.0904 0.0918 0.0988 0.0889 0.1462 0.1224 0.1413 0.1002 0.1146 0.1136 0.1327 0.1937
va: 5.8723 2.0041 1.9969 2.1421 2.0362 2.0323 2.1268 2.1201 3.3704 3.0855 2.9015 3.1890 2.9649 2.9690 4.0679 3.6844 4.1080 3.8481 4.1085 4.4017 3.8328 4.2580 3.9160 3.9776 4.0120 3.9441 3.8397 3.8453 1.0081 1.0587 0.9920 1.0014 1.0103 0.9959 1.0102 1.0106 1.0055 1.0053 1.0163 0.9908 0.9946 0.9984 0.9950 0.9958 0.9935 1.0159
dispcorr: -0.026458369 hartree
energy: -1797.825323661184
dipole: -6.93825 4.81036 -2.12789 13.21167 -11.94537 1.26629 7.64601 -5.70160 1.94441
magnitude: 3.14835 au
magnitude: 8.00248 debye
