program: Gaussian 09
title: 000069138
version: EM64L-G09RevD.01
frameworkgroup: C1[X(C7H9NO)]
method: RPBEPBE
basis: SDD
operation: Freq
keyword: #pfreq=noraman
keyword: PBEPBE/SDD
title: #p freq=noraman PBEPBE/SDD
converged: YES YES NO NO
title: Mulliken charges:
elementType: O N C C C C C C C H H H H H H H H H
charge: -0.484128 -0.411412 0.308555 0.154668 -0.340529 -0.351611 -0.242172 -0.245018 -0.636810 0.234970 0.331887 0.209943 0.217105 0.221716 0.225887 0.225985 0.220791 0.360172
chargesum: 0.00000
title: Mulliken charges with hydrogens summed into heavy atoms:
elementType: O N C C C C C C C
charge: -0.123957 -0.079525 0.308555 0.154668 -0.105559 -0.141669 -0.025066 -0.023302 0.035854
polarizability: 1.19260813e+02 -2.67799973e+00 9.67260172e+01 -1.94356280e-02 4.00393484e-04 4.10253415e+01
1716.lowfreq: -0.0007 -0.0004 0.0007 8.6238 13.5772 13.8888 102.0088 155.4543 201.2555
frequency: 102.0041 155.4520 201.2552 203.7838 289.1236 318.8883 328.0795 437.9525 457.9763 496.6256 511.4100 560.8650 584.5102 717.6060 730.2159 752.3500 817.0384 819.8551 883.5210 947.0374 1031.2968 1057.5666 1090.2424 1126.4535 1135.4672 1162.0704 1177.1256 1220.1837 1278.4859 1331.8729 1410.9423 1437.5991 1453.3670 1466.0608 1474.1105 1503.2223 1530.2968 1597.2853 1634.5261 2936.0310 2994.1139 3090.8888 3107.3447 3131.0806 3152.0012 3167.7188 3591.5023 3609.1700
redmass: 3.1551 1.5941 3.0899 1.9552 2.5437 1.3085 4.2145 2.0582 1.3201 5.4772 4.3831 3.9665 5.7275 3.7076 1.2422 4.2831 1.4841 5.6095 1.3770 1.2861 2.2112 3.0187 1.7400 1.2786 1.5309 1.2016 1.3210 2.0389 1.6504 1.8565 3.4503 1.9159 1.5479 1.0413 1.6364 1.0813 3.4752 5.8250 6.5265 1.0381 1.1006 1.0951 1.0890 1.0864 1.0925 1.1000 1.0773 1.0663
irintensity: 11.3803 1.1116 2.9514 0.8417 34.6576 125.8944 8.8731 50.5996 64.6503 0.2295 5.4829 0.0008 1.4390 0.1666 123.9654 8.6945 1.4605 19.8385 5.0050 0.0812 7.4353 68.0621 62.6788 2.2231 133.4903 3.4886 9.9504 2.7165 43.1380 29.6812 29.3016 9.7153 10.5702 11.7513 4.4632 21.4084 214.4880 12.4533 146.7765 106.9573 61.4321 27.2921 19.4482 8.4032 28.2764 17.3360 58.0842 36.7181
temp: 298.150 k
press: 1.00000 atm
elementType: 8 7 6 6 6 6 6 6 6 1 1 1 1 1 1 1 1 1
symmnumber: 1
zpe: 384082.5 jmol-1
zpe.correction: 0.146289 hartree
zpe.thermalcorrener: 0.154945 hartree
zpe.thermalcorrenthalpy: 0.155889 hartree
zpe.thermalcorrgfe: 0.113337 hartree
zpe.sumelectzpe: -401.442478 hartree
zpe.sumelectthermal: -401.433822 hartree
zpe.sumelectthermalent: -401.432878 hartree
zpe.sumelectthermalfe: -401.475430 hartree
dipole: -0.7415 1.0934 0.0080
dipole: 1.3211
quadrupole: -43.9897 -44.9562 -58.8777
quadrupole: 4.5250 0.0031 0.0221
quadrupole: 5.2848 4.3184 -9.6032 4.5250 0.0031 0.0221
hfenergy: -401.588767 hartree
pointgroup: C01 [X(C7H9N1O1)]
dipole: 0.3053414 0.4206369 0.0003735 debye
dipolederiv: -0.2064646 -0.3850058 -0.0141386 -0.3082155 -1.2643003 -0.0145281 -0.0125289 -0.0135793 -0.4281635 -1.5330958 -0.0216559 0.0248026 -0.2031272 -0.3262294 0.0081381 0.016384 0.0040349 -0.4994428 1.4772912 0.3009395 -0.024942 0.35242 -0.2046374 -0.0163791 -0.0230761 -0.015213 0.115123 -0.2571946 0.1570715 0.009647 0.4812781 1.1477293 0.0180899 0.0180321 0.0259905 -0.0068948 -0.2100757 0.1092912 0.0016413 -0.3872381 0.033959 0.0169289 -0.0108113 0.0048613 -0.2457421 0.1054857 -0.1016272 -0.0094343 0.0767674 -0.002937 0.0027207 -0.0048312 0.006983 -0.179178 0.120074 -0.1634285 -0.0111711 0.0857728 0.0846954 0.0046103 -0.0047645 0.0106644 -0.1729369 -0.1298243 0.0871954 0.0000868 -0.11131 -0.1473362 0.0047103 -0.0051121 -0.0002617 -0.221847 0.507546 -0.1538318 -0.010043 -0.4278538 0.3664166 0.0133684 -0.0159032 0.0066741 0.3112037 -0.0137326 0.1102469 0.007541 0.1028841 -0.0140321 -0.0074682 0.0073041 -0.0076197 0.1722719 0.1619664 0.0251222 0.0049306 0.0781992 0.1918853 -0.0055059 0.0070695 -0.0034553 0.3420245 0.0162383 0.0941077 0.0061122 0.1220307 -0.0928895 -0.0096667 0.0067968 -0.0089243 0.1682143 0.058343 -0.0641038 0.0008741 -0.0818042 -0.1180069 -0.0053809 0.0003547 -0.0058451 0.1639639 -0.1309365 -0.0434617 0.0062877 -0.0363052 0.0721566 -0.0018787 0.0064429 -0.001638 0.1778492 0.0369261 -0.020442 -0.0413595 0.1618829 -0.0421919 -0.1244819 0.0670511 -0.1276172 -0.114946 0.0380927 -0.0183828 0.0357467 0.1685049 -0.0565209 0.119828 -0.0618409 0.1311232 -0.0976098 -0.1387362 -0.0583702 0.0034628 -0.1392192 0.0323925 -0.0004468 0.0013067 -0.0022302 0.1241931 0.098097 0.1463352 0.0099557 0.0653331 0.3398468 -0.0026584 0.0081263 -0.0039477 0.3919172 unknown
polarizability: 119.3647667|1.9911794|96.5420123|-1.8406037|1.3821059|41.1053925 unknown
InChI: InChI=1S/C7H9NO/c1-8-6-4-2-3-5-7(6)9/h2-5,8-9H,1H3
charge 0 multiplicity 1
18 atoms
O  0.16031 2.30825 0.004849
N  1.904902 0.278636 -0.089053
C  0.554498 -0.053322 -0.065497
C  -0.405841 1.006918 -0.015135
C  0.063171 -1.387207 -0.088401
C  -1.785559 0.752469 0.011536
C  -1.328139 -1.645133 -0.061538
C  -2.258688 -0.585484 -0.011793
C  2.9723 -0.711026 -0.140059
H  0.770134 -2.221902 -0.127786
H  2.128317 1.272272 -0.07062
H  -2.495916 1.589662 0.050221
H  -1.681131 -2.682292 -0.080125
H  -3.334634 -0.785118 0.008761
H  2.916417 -1.337939 -1.054673
H  2.950308 -1.392079 0.736387
H  3.946894 -0.195484 -0.142511
H  -0.545243 2.998179 0.036536
