program: Orca
programVersion: 4.2.1
elementType: S O O O O O O O N N N N N N C C C C C C C C C C C C C C H H H H H H H H H H H H H H H H H H
charge: 0
multiplicity: 1
keywords: wb97x-d3
keywords: def2-TZVPP
keywords: def2/J RIJCOSX GRIDX6 NOFINALGRIDX
keywords: grid4 nofinalgrid
keywords: scfconv7
keywords: smallprint printgap noloewdin
keywords: NOSOSCF
formula: C14H18N6O7S
InChI: InChI=1S/C14H18N6O7S/c1-5-27-12(21)8-7-15-20(2)11(8)28(23,24)19-14(22)18-13-16-9(25-3)6-10(17-13)26-4/h6-7,18-19H,5H2,1-4H3
46 atoms
S  1.832048 -1.853301 0.787267
O  1.744666 -1.544887 2.196104
O  2.350717 -3.135921 0.372493
O  1.417699 2.795802 0.147933
O  0.567788 1.051579 1.267525
O  0.908088 -1.945441 -1.977841
O  -3.005491 0.035382 2.517301
O  -4.833355 1.592344 -1.453298
N  3.874908 -0.802688 -0.740559
N  0.302326 -1.652091 0.190187
N  4.359648 0.328183 -1.234872
N  -1.120777 -1.053916 -1.548451
N  -2.066065 -0.550023 0.51429
N  -2.982305 0.251615 -1.507825
C  2.752942 -0.586497 -0.030852
C  2.500021 0.779183 -0.071054
C  3.545729 1.28711 -0.848981
C  4.571251 -2.040847 -1.048324
C  1.39261 1.528848 0.525937
C  0.083454 -1.581694 -1.164854
C  0.369891 3.668821 0.61121
C  -2.096541 -0.422699 -0.799797
C  -0.902201 3.502994 -0.186374
C  -2.998023 0.10732 1.198157
C  -3.916204 0.88786 -0.813298
C  -3.976677 0.862713 0.574783
C  -2.007167 -0.739897 3.178909
C  -4.785259 1.664141 -2.877045
H  3.735765 2.30933 -1.132636
H  -0.413145 -1.235782 0.80473
H  5.452708 -1.767823 -1.616848
H  3.947428 -2.693626 -1.650934
H  4.881023 -2.551044 -0.142053
H  0.776887 4.668941 0.478802
H  0.197698 3.514069 1.676628
H  -1.617021 4.262881 0.130073
H  -0.725108 3.636002 -1.253487
H  -1.366778 2.530389 -0.027168
H  -4.735505 1.394211 1.12971
H  -2.236307 -0.669342 4.238313
H  -2.043228 -1.786818 2.878394
H  -1.008642 -0.33817 3.008136
H  -5.617183 2.300461 -3.164861
H  -3.855424 2.111293 -3.227077
H  -4.90955 0.683459 -3.334646
H  -1.235379 -0.976423 -2.550989
elementType: S O N C H
totalener: -1797.79968992 hartree
nucrepener: 3164.60312498 hartree
electener: -4962.40281491 hartree
oneelecener: -8758.38987190 hartree
twoeener: 3795.98705699 hartree
cpcmener: -0.04368145 hartree
kineticenergy: 1791.36108536 hartree
xcener: -147.481491024051 hartree
chargesum: -0.0000000
charge: 0.890607 -0.492388 -0.491808 -0.286893 -0.456466 -0.470703 -0.295649 -0.298912 0.182138 -0.207436 -0.317573 -0.129256 -0.409378 -0.413074 -0.113136 -0.057680 -0.060939 -0.147831 0.496392 0.357312 0.043997 0.340560 -0.207488 0.438839 0.414913 -0.327412 -0.122962 -0.113312 0.165658 0.226498 0.115347 0.124742 0.133172 0.113372 0.092684 0.104143 0.097723 0.015396 0.144878 0.140732 0.120844 0.103837 0.132805 0.112967 0.115190 0.195549
qa: 0.8906 -0.4924 -0.4918 -0.2869 -0.4565 -0.4707 -0.2956 -0.2989 0.1821 -0.2074 -0.3176 -0.1293 -0.4094 -0.4131 -0.1131 -0.0577 -0.0609 -0.1478 0.4964 0.3573 0.0440 0.3406 -0.2075 0.4388 0.4149 -0.3274 -0.1230 -0.1133 0.1657 0.2265 0.1153 0.1247 0.1332 0.1134 0.0927 0.1041 0.0977 0.0154 0.1449 0.1407 0.1208 0.1038 0.1328 0.1130 0.1152 0.1955
va: 5.8673 1.9950 2.0073 2.1454 2.0270 2.0324 2.1326 2.1209 3.3838 3.0838 2.9013 3.1933 2.9636 2.9517 4.0801 3.6276 4.1139 3.8513 4.1111 4.4118 3.8512 4.2490 3.9076 3.9529 3.9981 3.9249 3.8403 3.8470 1.0083 1.0545 1.0105 0.9984 0.9931 0.9971 1.0108 1.0097 1.0068 1.0316 1.0179 0.9951 0.9901 1.0005 0.9939 0.9952 0.9949 1.0148
dispcorr: -0.028578697 hartree
energy: -1797.828268620278
dipole: -10.23182 8.21935 -2.01248 14.61954 -12.17758 2.44196 -3.07070 2.12714 -0.94356
magnitude: 3.30205 au
magnitude: 8.39315 debye
