program: Orca
programVersion: 4.2.1
elementType: S O O O O O O O N N N N N N C C C C C C C C C C C C C C H H H H H H H H H H H H H H H H H H
charge: 0
multiplicity: 1
keywords: wb97x-d3
keywords: def2-TZVPP
keywords: def2/J RIJCOSX GRIDX6 NOFINALGRIDX
keywords: grid4 nofinalgrid
keywords: scfconv7
keywords: smallprint printgap noloewdin
keywords: NOSOSCF
formula: C14H18N6O7S
InChI: InChI=1S/C14H18N6O7S/c1-5-27-12(21)8-7-15-20(2)11(8)28(23,24)19-14(22)18-13-16-9(25-3)6-10(17-13)26-4/h6-7,18-19H,5H2,1-4H3
46 atoms
S  1.659852 -0.655646 1.580397
O  1.649706 0.673718 2.147183
O  2.029764 -1.787027 2.398881
O  2.645078 2.581936 -1.48346
O  0.822825 1.654684 -0.563264
O  0.550702 -2.901209 0.064479
O  -3.098608 2.106308 1.14105
O  -5.773504 -0.819671 -1.267331
N  3.650699 -1.532412 -0.1349
N  0.1327 -0.870922 0.98601
N  4.360691 -1.157102 -1.187351
N  -1.501985 -2.006358 -0.211279
N  -2.272841 0.074155 0.485838
N  -3.633618 -1.421931 -0.732662
C  2.700831 -0.62482 0.161746
C  2.819744 0.407042 -0.755681
C  3.882041 0.009373 -1.570772
C  3.995547 -2.782154 0.520702
C  1.97956 1.600404 -0.902721
C  -0.219559 -1.985042 0.270254
C  1.956559 3.823335 -1.730402
C  -2.509496 -1.065216 -0.140481
C  1.855507 4.676347 -0.488142
C  -3.272302 0.951849 0.521831
C  -4.617619 -0.534616 -0.692114
C  -4.4993 0.700293 -0.066725
C  -1.842236 2.383623 1.757927
C  -5.936782 -2.083036 -1.908083
H  4.294473 0.515782 -2.428083
H  -0.521384 -0.076163 0.996993
H  4.706949 -3.286741 -0.123471
H  3.119476 -3.409105 0.642336
H  4.460194 -2.599163 1.485477
H  0.974899 3.625558 -2.162341
H  2.562398 4.318631 -2.485922
H  2.837168 4.862292 -0.052281
H  1.426276 5.640446 -0.761648
H  1.2143 4.232362 0.27212
H  -5.310159 1.413086 -0.037902
H  -1.602857 1.654134 2.531954
H  -1.037506 2.425209 1.024804
H  -1.951751 3.361673 2.217922
H  -6.951972 -2.085283 -2.29467
H  -5.239134 -2.208829 -2.735304
H  -5.818892 -2.908542 -1.20708
H  -1.736529 -2.848638 -0.719728
elementType: S O N C H
totalener: -1797.80066276 hartree
nucrepener: 3069.25460380 hartree
electener: -4867.05526656 hartree
oneelecener: -8567.95907886 hartree
twoeener: 3700.90381230 hartree
cpcmener: -0.04103146 hartree
kineticenergy: 1791.35609477 hartree
xcener: -147.480251335816 hartree
chargesum: 0.0000000
charge: 0.876578 -0.494053 -0.491935 -0.287120 -0.457898 -0.486901 -0.299354 -0.300852 0.184189 -0.192765 -0.319127 -0.130825 -0.428861 -0.427436 -0.090679 -0.077955 -0.062530 -0.154015 0.495007 0.387939 0.047092 0.372740 -0.259952 0.423290 0.419736 -0.325484 -0.122003 -0.115382 0.168226 0.227023 0.116705 0.126260 0.132961 0.092663 0.113360 0.092674 0.098992 0.087555 0.146800 0.115681 0.104096 0.141941 0.132536 0.114473 0.114778 0.191832
qa: 0.8766 -0.4941 -0.4919 -0.2871 -0.4579 -0.4869 -0.2994 -0.3009 0.1842 -0.1928 -0.3191 -0.1308 -0.4289 -0.4274 -0.0907 -0.0780 -0.0625 -0.1540 0.4950 0.3879 0.0471 0.3727 -0.2600 0.4233 0.4197 -0.3255 -0.1220 -0.1154 0.1682 0.2270 0.1167 0.1263 0.1330 0.0927 0.1134 0.0927 0.0990 0.0876 0.1468 0.1157 0.1041 0.1419 0.1325 0.1145 0.1148 0.1918
va: 5.8879 2.0028 2.0064 2.1445 2.0335 2.0234 2.1308 2.1205 3.3683 3.0998 2.8972 3.1892 2.9694 2.9681 4.0303 3.7234 4.1032 3.8492 4.1131 4.3845 3.8294 4.2438 3.9218 3.9858 4.0158 3.9341 3.8444 3.8461 1.0055 1.0461 1.0092 1.0023 0.9912 1.0112 0.9962 1.0048 1.0066 1.0081 1.0160 0.9943 0.9978 0.9947 0.9934 0.9951 0.9953 1.0174
dispcorr: -0.025490789 hartree
energy: -1797.826153553764
dipole: -4.17194 2.59027 -1.58167 12.47339 -11.37218 1.10121 -5.99566 4.22146 -1.77420
magnitude: 2.61956 au
magnitude: 6.65840 debye
