program: Gaussian 09
title: 000074139
version: EM64L-G09RevD.01
frameworkgroup: C1[X(C7H6N4O4)]
method: RPBEPBE
basis: SDD
operation: Freq
keyword: #pfreq=noraman
keyword: PBEPBE/SDD
title: #p freq=noraman PBEPBE/SDD
converged: NO YES NO NO
title: Mulliken charges:
elementType: O O O O N N N N C C C C C C C H H H H H H
charge: -0.243432 -0.230083 -0.202320 -0.197912 -0.116160 -0.310902 -0.111835 0.052171 0.161476 0.317045 -0.305098 0.091676 0.287345 -0.299646 -0.626473 0.356146 0.301746 0.299059 0.289138 0.244016 0.244042
chargesum: 0.00000
title: Mulliken charges with hydrogens summed into heavy atoms:
elementType: O O O O N N N N C C C C C C C
charge: -0.243432 -0.230083 -0.202320 -0.197912 -0.116160 0.045243 -0.111835 0.052171 0.161476 0.317045 -0.003352 0.091676 0.287345 -0.000587 0.150723
polarizability: 2.48260313e+02 1.15143538e+00 1.33718073e+02 1.16436848e-02 8.95852341e-03 5.10149045e+01
1716.lowfreq: -8.2982 -0.7493 -0.0009 -0.0003 -0.0001 3.3027 36.6955 54.2831 65.2962
frequency: 36.6904 54.2779 65.2927 69.8317 101.9265 162.9061 175.8197 191.2415 238.5946 254.2602 272.1592 289.7641 384.5258 391.8016 449.6522 512.8236 562.3089 585.5814 604.0822 647.3722 673.5372 684.7762 717.7063 734.3488 769.9008 832.3695 855.3182 914.1481 917.2919 938.1894 977.3615 1010.5370 1023.2427 1116.4040 1122.8651 1136.4042 1186.9295 1208.0101 1255.0031 1262.4499 1324.0327 1349.6585 1366.4323 1411.5170 1433.6699 1458.1211 1472.4961 1479.2079 1523.3475 1623.7123 1677.5769 2975.3154 3061.2320 3099.7494 3244.4070 3261.4018 3588.8193
redmass: 3.9970 8.1908 7.1665 4.8869 5.4645 3.6160 1.3741 8.0359 7.9557 4.0356 3.9003 8.0175 6.7295 1.5123 8.4856 8.1442 5.6500 5.1747 5.3480 7.4145 7.6514 8.0061 8.3201 13.0504 7.9572 1.3095 8.0551 1.3846 8.6677 6.4269 7.6806 1.9099 1.4716 3.5905 1.2858 5.8119 2.2246 1.7729 4.7770 4.1513 6.2094 9.2496 4.8216 1.8431 2.8720 2.5652 1.0427 1.0935 6.5998 8.7960 11.6252 1.0335 1.1034 1.0983 1.0958 1.1046 1.0838
irintensity: 6.9798 3.3234 10.4717 8.3027 15.6848 3.1162 0.1596 1.4119 2.9916 5.0789 21.3167 0.4548 1.5137 110.8096 2.5190 0.2696 0.4209 0.3775 4.8101 11.7291 8.6025 3.3417 7.4210 19.2042 14.2721 64.5205 7.6881 0.5419 15.1152 19.8664 11.4859 17.6696 26.1258 1.8313 0.1978 114.1172 7.9936 78.1577 188.7571 218.4491 78.1854 32.9448 118.4477 26.0696 179.9068 98.6552 21.6871 39.9190 21.9402 40.6417 678.4216 62.4478 26.6049 1.5698 1.4431 10.1914 87.2758
temp: 298.150 k
press: 1.00000 atm
elementType: 8 8 8 8 7 7 7 7 6 6 6 6 6 6 6 1 1 1 1 1 1
symmnumber: 1
zpe: 363296.3 jmol-1
zpe.correction: 0.138372 hartree
zpe.thermalcorrener: 0.151777 hartree
zpe.thermalcorrenthalpy: 0.152721 hartree
zpe.thermalcorrgfe: 0.096609 hartree
zpe.sumelectzpe: -789.023270 hartree
zpe.sumelectthermal: -789.009865 hartree
zpe.sumelectthermalent: -789.008921 hartree
zpe.sumelectthermalfe: -789.065033 hartree
dipole: 0.1695 2.4903 0.0017
dipole: 2.4961
quadrupole: -120.2289 -80.7348 -84.5512
quadrupole: 32.8137 -0.0015 0.0032
quadrupole: -25.0573 14.4369 10.6204 32.8137 -0.0015 0.0032
hfenergy: -789.161642 hartree
pointgroup: C01 [X(C7H6N4O4)]
dipole: 0.0597406 0.9802132 0.0006802 debye
dipolederiv: -0.1753174 -0.1248875 -0.0000064 -0.0444726 -0.5348999 -0.0000946 0.0001027 -0.0001502 -0.0845242 -1.5669967 0.3896407 -0.0000936 0.3472856 -0.4771773 0.0000321 0.0001741 -0.0000344 -0.3709727 -1.1768831 -0.0539077 0.0000645 -0.1651219 -0.4502078 0.0000516 -0.0005892 -0.0001604 -0.2298674 -0.4405245 0.0024397 -0.0000863 0.3846494 -0.8049894 -0.0002767 -0.0001213 0.0001527 -0.2208193 -0.9440351 -0.5134017 0.0000082 0.373033 -0.5100101 -0.000124 -0.0002509 -0.0003836 -0.1639765 0.2106175 0.4559694 0.0000283 0.3165551 -0.7366089 0.0001806 0.0001557 0.0005835 -0.205736 -1.0991914 0.3055175 -0.0000248 -0.166856 -0.3482761 0.0000283 -0.0001597 0.0000083 -0.2727659 2.0877776 -0.2558442 0.0000836 -0.8110636 1.2916293 0.0001748 0.0004547 0.0001923 0.2102183 0.3978702 -0.228927 -0.000012 -0.3600196 0.6573721 -0.000084 0.0001053 -0.0000221 0.1222684 0.5153242 0.124825 0.0000161 0.4379487 0.2768676 0.0000902 0.000049 0.0000472 0.060437 -0.5402674 -0.0100753 -0.0000315 -0.3714902 0.0170113 0.0000141 -0.0000149 0.0000557 -0.1399806 2.3280983 -0.6238242 0.000122 -0.8286481 0.7062075 0.0000492 -0.0000576 0.000019 0.2319799 -0.7723491 0.2691919 -0.0000448 0.9748267 -0.1449263 0.0000756 0.0000743 -0.0001047 0.0877261 0.4030888 -0.0282052 0.0000135 -0.3542639 0.1229392 0.0000013 0.0000997 -0.0000059 -0.1040568 0.2430253 0.3311025 -0.0000231 0.2728454 0.4410397 -0.0000075 0.0000232 0.0001032 0.2639777 0.1778406 -0.0311501 -0.0000062 0.0610094 0.2600334 -0.0000558 -0.0000159 -0.0002762 0.38789 0.1083326 0.0458129 0. 0.0469756 0.1094064 -0.0000209 -0.0000492 -0.0000251 0.1933212 0.0795834 -0.0268022 -0.0000118 -0.0036361 0.1416214 -0.0000099 -0.0000163 -0.0000012 0.1985303 0.0254488 -0.0183184 -0.0000168 0.0963537 0.1143985 0.0000201 -0.000014 0.0000082 0.1502169 0.0692673 -0.0045538 0.0662985 -0.102946 -0.0657317 -0.0805899 -0.0040212 -0.1306607 -0.0569129 0.06929 -0.0046023 -0.0662773 -0.1029646 -0.0656991 0.0805456 0.0040715 0.1306546 -0.0569537 unknown
polarizability: 248.2382058|1.9640462|133.7401794|0.0115798|0.0090409|51.0149045 unknown
InChI: InChI=1S/C7H6N4O4/c1-10-7(12)8-6(9-10)4-2-3-5(15-4)11(13)14/h2-3,9H,1H3
charge 0 multiplicity 1
21 atoms
O  -1.179416 0.403034 0.000421
O  4.538067 -0.890051 0.000336
O  -4.754891 0.161726 -0.000257
O  -3.363856 1.997435 0.000277
N  2.954241 0.889325 0.000558
N  1.558037 0.946771 0.000358
N  2.128515 -1.257966 0.000181
N  -3.585095 0.723448 0.000603
C  1.121603 -0.36533 0.000274
C  -0.285513 -0.689462 0.000202
C  -0.992648 -1.891519 0.000025
C  3.346199 -0.504015 0.00048
C  -2.459793 -0.168096 0.000322
C  -2.387253 -1.557191 -0.000019
C  3.823792 2.054185 0.00048
H  1.028342 1.817883 0.000883
H  -0.53896 -2.879505 -0.00014
H  -3.238715 -2.232499 -0.00018
H  4.851081 1.65218 0.000611
H  3.684561 2.674034 0.90528
H  3.684701 2.673811 -0.904494
