program: Orca
programVersion: 4.2.1
elementType: S O O O O O O O N N N N N N C C C C C C C C C C C C C C H H H H H H H H H H H H H H H H H H
charge: 0
multiplicity: 1
keywords: wb97x-d3
keywords: def2-TZVPP
keywords: def2/J RIJCOSX GRIDX6 NOFINALGRIDX
keywords: grid4 nofinalgrid
keywords: scfconv7
keywords: smallprint printgap noloewdin
keywords: NOSOSCF
formula: C14H18N6O7S
InChI: InChI=1S/C14H18N6O7S/c1-5-27-12(21)8-7-15-20(2)11(8)28(23,24)19-14(22)18-13-16-9(25-3)6-10(17-13)26-4/h6-7,18-19H,5H2,1-4H3
46 atoms
S  1.67402 -0.380606 1.615215
O  1.71077 0.989558 2.068559
O  1.846899 -1.449292 2.571227
O  1.451476 1.82382 -0.638262
O  2.90476 1.930084 -2.336644
O  0.626884 -2.624008 0.046734
O  -3.138986 2.239818 1.289662
O  -5.736162 -0.648681 -1.249934
N  3.725642 -1.633666 0.279271
N  0.219328 -0.541085 0.842724
N  4.517224 -1.551587 -0.778995
N  -1.416911 -1.729286 -0.298573
N  -2.24569 0.295693 0.488044
N  -3.572442 -1.191531 -0.772823
C  2.847437 -0.611632 0.317025
C  3.096475 0.18018 -0.798652
C  4.155769 -0.473049 -1.4371
C  3.913691 -2.763619 1.173119
C  2.481234 1.397043 -1.338391
C  -0.138202 -1.696537 0.199178
C  0.783557 3.023872 -1.063276
C  -2.451353 -0.826143 -0.182177
C  -0.298498 2.731533 -2.0746
C  -3.281112 1.123662 0.599532
C  -4.588366 -0.345816 -0.675199
C  -4.508489 0.857141 0.018163
C  -1.910397 2.486344 1.965339
C  -5.848086 -1.879828 -1.959299
H  4.656017 -0.189425 -2.349458
H  -0.481074 0.20792 0.928115
H  4.688292 -3.378199 0.727364
H  3.002186 -3.345923 1.26015
H  4.2426 -2.436429 2.15511
H  1.506458 3.742739 -1.450505
H  0.363251 3.443951 -0.150402
H  -1.028071 2.018683 -1.688576
H  -0.829234 3.655941 -2.304752
H  0.106892 2.339703 -3.007467
H  -5.347288 1.5321 0.104752
H  -1.671111 1.695804 2.677387
H  -1.0825 2.61509 1.267267
H  -2.052367 3.418143 2.50602
H  -6.866546 -1.907581 -2.337675
H  -5.152832 -1.927181 -2.797563
H  -5.683979 -2.73781 -1.307233
H  -1.64278 -2.57383 -0.807986
elementType: S O N C H
totalener: -1797.79968274 hartree
nucrepener: 3109.27474764 hartree
electener: -4907.07443038 hartree
oneelecener: -8646.40981805 hartree
twoeener: 3739.33538767 hartree
cpcmener: -0.03751649 hartree
kineticenergy: 1791.37272601 hartree
xcener: -147.482366096413 hartree
chargesum: -0.0000000
charge: 0.867082 -0.478656 -0.481655 -0.269593 -0.455521 -0.462722 -0.286522 -0.289709 0.188358 -0.190921 -0.316029 -0.134628 -0.434214 -0.423598 -0.102859 -0.080205 -0.052832 -0.153907 0.491591 0.383926 -0.013756 0.374892 -0.235678 0.402067 0.411368 -0.309355 -0.111437 -0.117204 0.157895 0.201493 0.115043 0.125852 0.131071 0.111820 0.123564 0.067178 0.104952 0.098882 0.145621 0.126481 0.079635 0.140972 0.131818 0.114153 0.114392 0.190893
qa: 0.8671 -0.4787 -0.4817 -0.2696 -0.4555 -0.4627 -0.2865 -0.2897 0.1884 -0.1909 -0.3160 -0.1346 -0.4342 -0.4236 -0.1029 -0.0802 -0.0528 -0.1539 0.4916 0.3839 -0.0138 0.3749 -0.2357 0.4021 0.4114 -0.3094 -0.1114 -0.1172 0.1579 0.2015 0.1150 0.1259 0.1311 0.1118 0.1236 0.0672 0.1050 0.0989 0.1456 0.1265 0.0796 0.1410 0.1318 0.1142 0.1144 0.1909
va: 5.8978 2.0105 2.0223 2.1314 2.0569 2.0553 2.1378 2.1347 3.3665 3.0859 2.9000 3.1855 2.9367 2.9700 4.0809 3.6442 4.1089 3.8504 4.1638 4.3861 3.8454 4.2314 3.9149 3.9899 4.0332 3.9347 3.8494 3.8490 1.0139 1.0702 1.0104 1.0008 0.9923 1.0158 0.9771 1.0080 1.0076 1.0128 1.0162 0.9947 0.9869 0.9972 0.9934 0.9953 0.9954 1.0182
dispcorr: -0.027405596 hartree
energy: -1797.827088338857
dipole: -11.80556 8.66777 -3.13779 6.63372 -6.33728 0.29645 -6.46486 6.11772 -0.34714
magnitude: 3.17082 au
magnitude: 8.05959 debye
