program: Gaussian 09
title: 000074126
version: EM64L-G09RevD.01
frameworkgroup: C1[X(C9H9Cl)]
method: RPBEPBE
basis: SDD
operation: Freq
keyword: #pfreq=noraman
keyword: PBEPBE/SDD
title: #p freq=noraman PBEPBE/SDD
converged: NO YES NO NO
title: Mulliken charges:
elementType: Cl C C C C C C C C C H H H H H H H H H
charge: -0.093170 0.537364 0.476626 -0.374808 -0.361731 -0.388972 -0.375169 -0.771167 -0.195672 -0.566102 0.236872 0.236352 0.230186 0.226393 0.267043 0.267746 0.216098 0.218355 0.213754
chargesum: 0.00000
title: Mulliken charges with hydrogens summed into heavy atoms:
elementType: Cl C C C C C C C C C
charge: -0.093170 0.537364 0.476626 -0.137936 -0.125379 -0.158786 -0.148776 -0.236378 0.020426 -0.133993
polarizability: 1.87328750e+02 -9.37893774e+00 9.78466801e+01 -7.28984430e+00 -1.87655285e+00 5.87036192e+01
1716.lowfreq: -15.1342 -6.0836 -2.8450 0.0013 0.0013 0.0016 40.6370 55.1420 94.1629
frequency: 40.6185 55.1182 94.1619 181.9565 204.9812 316.5445 329.6765 403.9166 419.9003 474.0812 532.2750 596.8757 636.4321 658.8762 721.9832 772.3156 825.7173 843.4473 862.8029 901.7472 936.1357 965.4664 976.2902 1009.6914 1010.7047 1031.7495 1102.9644 1139.3989 1193.0649 1221.8898 1238.0306 1243.0974 1295.7880 1328.3706 1381.3788 1416.3201 1438.5264 1461.9146 1508.8371 1573.7400 1619.5188 1644.4344 3066.7412 3090.2723 3104.9014 3121.3639 3127.3553 3144.6652 3148.5403 3154.5715 3206.2659
redmass: 4.4178 4.6363 3.2458 3.7264 3.0034 3.5063 2.5806 2.7517 4.0731 3.0986 3.1954 4.3633 6.7347 1.7448 3.3592 2.9686 4.8516 1.2808 1.7543 1.5198 1.3433 1.3829 1.3867 2.9319 1.1773 1.4953 1.2313 1.1821 1.1592 2.1189 1.7703 1.6368 1.3962 1.2575 4.3367 3.2516 1.2838 1.1273 2.6294 6.1913 6.2380 4.3722 1.0575 1.0790 1.0730 1.0874 1.0879 1.0972 1.1107 1.0964 1.1140
irintensity: 1.2332 0.4604 1.0869 2.7613 1.7963 6.8887 4.9535 0.2471 6.0475 20.7363 4.0196 83.0636 0.1190 15.9635 17.6942 1.5480 11.8627 0.8063 50.4574 0.3203 84.0778 0.3211 0.4434 2.2395 20.2941 12.4562 6.0536 3.9687 3.9293 6.6457 8.9205 60.6879 1.3010 0.6149 3.6199 10.7466 5.7118 5.5305 5.4284 1.9583 12.8815 11.0472 24.8149 20.8637 4.8159 10.8908 9.7505 20.9162 11.9003 6.4197 22.0992
temp: 298.150 k
press: 1.00000 atm
elementType: 17 6 6 6 6 6 6 6 6 6 1 1 1 1 1 1 1 1 1
symmnumber: 1
zpe: 393424.4 jmol-1
zpe.correction: 0.149847 hartree
zpe.thermalcorrener: 0.159353 hartree
zpe.thermalcorrenthalpy: 0.160297 hartree
zpe.thermalcorrgfe: 0.113562 hartree
zpe.sumelectzpe: -807.684038 hartree
zpe.sumelectthermal: -807.674532 hartree
zpe.sumelectthermalent: -807.673588 hartree
zpe.sumelectthermalfe: -807.720323 hartree
dipole: 2.0809 0.3858 1.7314
dipole: 2.7343
quadrupole: -67.8093 -58.3887 -69.8623
quadrupole: -1.2395 -7.3463 -1.5369
quadrupole: -2.4559 6.9647 -4.5089 -1.2395 -7.3463 -1.5369
hfenergy: -807.8338852 hartree
pointgroup: C01 [X(C9H9Cl1)]
dipole: -0.7794842 0.1219475 -0.7313049 debye
dipolederiv: -0.7960986 0.0323911 -0.1441401 0.0920739 -0.191269 0.0298714 -0.6294624 0.0432025 -0.4345398 -0.33671 -0.0050067 0.008476 0.0508211 -0.0149169 0.0053821 0.2424429 0.0046733 -0.1308459 0.2476979 0.0520049 -0.0226344 0.0886447 -0.019334 -0.011841 -0.0199994 -0.013253 0.0703921 0.0891892 0.1171134 -0.0247356 0.0340743 0.0619625 -0.0104729 -0.0354655 0.0074961 -0.1318498 0.0178062 -0.0922905 -0.0246089 -0.0399233 0.0705901 0.034981 -0.0168476 0.0146489 -0.1295327 -0.2137684 -0.1296899 -0.0186128 -0.1586497 0.0645359 0.0159193 -0.0027986 0.0343592 -0.1647386 -0.1858053 0.0972289 -0.0038923 0.1635081 0.0189593 0.0069377 0.010345 -0.007509 -0.141181 1.0974611 -0.0465771 0.2340216 -0.1024673 0.1857642 -0.0465106 0.4947092 -0.0525875 0.5575403 0.2530475 -0.0086436 -0.0495221 -0.2203612 0.1422303 0.0381276 -0.0728474 0.0232924 -0.1371457 -0.2444598 -0.106382 -0.0404152 -0.1130852 0.019948 0.0483599 -0.0321668 0.0424516 -0.386562 0.0125528 -0.1065764 0.0195766 -0.0943232 -0.0315602 -0.00042 0.0089968 0.0025932 0.1417841 0.0339932 0.0865865 0.0282477 0.082567 -0.0497713 -0.0218621 0.0171487 -0.0219169 0.1373515 0.0272311 0.1013655 0.0198708 0.0840054 -0.0586906 -0.0205467 0.0263374 -0.0261995 0.1503191 0.0190116 -0.1035788 0.0074471 -0.0777242 -0.0327472 -0.0023844 0.0157142 0.003506 0.1438221 -0.0107891 -0.0095135 -0.0290126 -0.085262 -0.0299182 0.0959637 -0.0474726 0.059486 -0.0156335 -0.0033392 0.0086737 -0.0394336 0.0889986 -0.0176063 -0.090347 -0.0483409 -0.0536214 -0.037997 0.0190183 0.0050354 0.0170059 0.1136241 -0.1097004 -0.0308167 0.0264449 -0.01907 0.1474456 -0.1090501 0.0251928 0.0409041 0.0374343 0.0787224 -0.0134935 0.0439132 -0.0106425 0.1809409 0.0830117 0.0826663 0.0214576 0.0560446 -0.0871984 -0.0268478 0.0193486 -0.0309093 0.1804303 unknown
polarizability: 187.9152212|8.3383212|97.8113889|-0.7804403|0.3361398|58.1524388 unknown
InChI: InChI=1S/C9H9Cl/c1-2-8-3-5-9(7-10)6-4-8/h2-6H,1,7H2
charge 0 multiplicity 1
19 atoms
Cl 3.850311 -0.261356 1.08904
C  1.424436 0.031736 -0.364627
C  -1.409105 0.199243 0.044733
C  0.7909 1.289512 -0.196518
C  0.622376 -1.14155 -0.320861
C  -0.600626 1.369947 0.003393
C  -0.766513 -1.061576 -0.12085
C  2.901399 -0.059945 -0.581996
C  -2.864456 0.345334 0.254475
C  -3.794454 -0.648058 0.311575
H  1.393261 2.205324 -0.217793
H  1.100166 -2.121389 -0.439514
H  -1.075167 2.350769 0.129643
H  -1.357244 -1.983362 -0.091461
H  3.337142 0.85228 -1.013091
H  3.205504 -0.94851 -1.152934
H  -3.213221 1.381657 0.375663
H  -4.852473 -0.419227 0.474499
H  -3.538236 -1.70803 0.200326
