program: Orca
programVersion: 4.2.1
elementType: S O O O O O O O N N N N N N C C C C C C C C C C C C C C H H H H H H H H H H H H H H H H H H
charge: 0
multiplicity: 1
keywords: wb97x-d3
keywords: def2-TZVPP
keywords: def2/J RIJCOSX GRIDX6 NOFINALGRIDX
keywords: grid4 nofinalgrid
keywords: scfconv7
keywords: smallprint printgap noloewdin
keywords: NOSOSCF
formula: C14H18N6O7S
InChI: InChI=1S/C14H18N6O7S/c1-5-27-12(21)8-7-15-20(2)11(8)28(23,24)19-14(22)18-13-16-9(25-3)6-10(17-13)26-4/h6-7,18-19H,5H2,1-4H3
46 atoms
S  1.827295 -1.916827 0.711165
O  1.722869 -1.716688 2.136656
O  2.373052 -3.15174 0.200952
O  1.172675 2.701007 0.241243
O  0.570022 0.942561 1.482484
O  0.901837 -1.880575 -2.065835
O  -3.035495 -0.153265 2.513925
O  -4.891513 1.533684 -1.389345
N  3.83721 -0.715602 -0.752217
N  0.300233 -1.685239 0.115288
N  4.272434 0.453479 -1.198998
N  -1.142576 -1.047529 -1.592891
N  -2.082739 -0.629529 0.490921
N  -3.029148 0.218969 -1.495886
C  2.723242 -0.574619 -0.01239
C  2.419496 0.780685 0.013954
C  3.430652 1.363067 -0.758587
C  4.575562 -1.908717 -1.127754
C  1.295808 1.45666 0.666901
C  0.07533 -1.57062 -1.236443
C  0.085712 3.482702 0.768427
C  -2.127923 -0.466282 -0.819201
C  0.077102 4.804156 0.045631
C  -3.028788 -0.023126 1.202067
C  -3.96631 0.819999 -0.77594
C  -4.020792 0.742323 0.610842
C  -2.047715 -0.968153 3.141265
C  -4.839289 1.655971 -2.808192
H  3.57893 2.405076 -0.993819
H  -0.430172 -1.333333 0.751485
H  3.977205 -2.545234 -1.773335
H  4.894937 -2.463321 -0.250615
H  5.451438 -1.57112 -1.670956
H  0.222683 3.620496 1.842839
H  -0.85534 2.949694 0.614949
H  1.001462 5.360072 0.204655
H  -0.073502 4.675451 -1.026454
H  -0.744853 5.410487 0.42621
H  -4.787269 1.238363 1.188221
H  -1.046333 -0.556171 3.016639
H  -2.296628 -0.966729 4.199191
H  -2.076058 -1.99413 2.77306
H  -3.912275 2.12452 -3.138999
H  -4.950011 0.69033 -3.30191
H  -5.677896 2.292788 -3.077655
H  -1.264996 -0.934886 -2.591175
elementType: S O N C H
totalener: -1797.80127774 hartree
nucrepener: 3137.32211188 hartree
electener: -4935.12338962 hartree
oneelecener: -8703.58955580 hartree
twoeener: 3768.46616619 hartree
cpcmener: -0.03743818 hartree
kineticenergy: 1791.36986551 hartree
xcener: -147.479155184195 hartree
chargesum: 0.0000000
charge: 0.880610 -0.480204 -0.479858 -0.277733 -0.443778 -0.445973 -0.287269 -0.291328 0.180185 -0.215099 -0.312860 -0.138110 -0.411328 -0.418892 -0.105605 -0.049559 -0.061110 -0.151690 0.469358 0.348911 0.044804 0.347975 -0.253165 0.414701 0.414711 -0.321023 -0.125984 -0.115863 0.162359 0.228704 0.125798 0.132166 0.115468 0.103914 0.086288 0.090873 0.088985 0.091559 0.144369 0.107071 0.138870 0.118678 0.113419 0.113769 0.131210 0.191675
qa: 0.8806 -0.4802 -0.4799 -0.2777 -0.4438 -0.4460 -0.2873 -0.2913 0.1802 -0.2151 -0.3129 -0.1381 -0.4113 -0.4189 -0.1056 -0.0496 -0.0611 -0.1517 0.4694 0.3489 0.0448 0.3480 -0.2532 0.4147 0.4147 -0.3210 -0.1260 -0.1159 0.1624 0.2287 0.1258 0.1322 0.1155 0.1039 0.0863 0.0909 0.0890 0.0916 0.1444 0.1071 0.1389 0.1187 0.1134 0.1138 0.1312 0.1917
va: 5.8835 2.0087 2.0216 2.1456 2.0467 2.0633 2.1381 2.1315 3.3833 3.0740 2.9011 3.1838 2.9563 2.9614 4.0760 3.6250 4.1085 3.8541 4.1279 4.4207 3.8497 4.2605 3.9723 3.9879 4.0210 3.9331 3.8418 3.8493 1.0084 1.0497 0.9975 0.9935 1.0102 0.9969 0.9911 1.0031 1.0033 1.0061 1.0169 0.9998 0.9952 0.9907 0.9959 0.9953 0.9939 1.0175
dispcorr: -0.026859826 hartree
energy: -1797.828137563812
dipole: -8.34784 6.35031 -1.99752 17.39762 -15.07480 2.32282 -2.41555 1.58089 -0.83466
magnitude: 3.17526 au
magnitude: 8.07086 debye
