program: Orca
programVersion: 4.2.1
elementType: S O O O O O O O N N N N N N C C C C C C C C C C C C C C H H H H H H H H H H H H H H H H H H
charge: 0
multiplicity: 1
keywords: wb97x-d3
keywords: def2-TZVPP
keywords: def2/J RIJCOSX GRIDX6 NOFINALGRIDX
keywords: grid4 nofinalgrid
keywords: scfconv7
keywords: smallprint printgap noloewdin
keywords: NOSOSCF
formula: C14H18N6O7S
InChI: InChI=1S/C14H18N6O7S/c1-5-27-12(21)8-7-15-20(2)11(8)28(23,24)19-14(22)18-13-16-9(25-3)6-10(17-13)26-4/h6-7,18-19H,5H2,1-4H3
46 atoms
S  1.857521 -1.640702 1.067398
O  1.826455 -1.05501 2.385907
O  2.347498 -2.987368 0.895701
O  1.545899 2.837273 -0.360934
O  0.719159 1.353835 1.098408
O  0.813844 -2.333444 -1.571231
O  -2.929879 0.64337 2.504408
O  -5.028341 1.070051 -1.611104
N  3.802314 -0.970836 -0.77259
N  0.309681 -1.528703 0.491278
N  4.274987 0.028428 -1.503317
N  -1.215165 -1.39574 -1.258358
N  -2.059786 -0.390032 0.660058
N  -3.131579 -0.185681 -1.430894
C  2.754011 -0.580156 -0.026505
C  2.537023 0.765119 -0.298693
C  3.526769 1.076876 -1.238257
C  4.439485 -2.26998 -0.901305
C  1.502689 1.656457 0.232989
C  0.023018 -1.798741 -0.824996
C  0.592088 3.8393 0.03249
C  -2.176413 -0.626224 -0.634648
C  -0.764602 3.624555 -0.59602
C  -2.991381 0.380878 1.213832
C  -4.051792 0.584816 -0.867974
C  -4.037288 0.918228 0.481374
C  -1.885841 0.065799 3.285233
C  -5.049319 0.768179 -3.003629
H  3.721629 2.022314 -1.718824
H  -0.381554 -0.987928 1.030847
H  3.746013 -3.00077 -1.306532
H  4.825769 -2.613008 0.0538
H  5.265872 -2.139752 -1.591534
H  1.029127 4.773588 -0.315109
H  0.524285 3.886027 1.120085
H  -1.270028 2.745032 -0.200459
H  -1.393483 4.488681 -0.378765
H  -0.693125 3.531629 -1.679832
H  -4.792246 1.546997 0.930325
H  -0.905649 0.432363 2.981081
H  -2.076943 0.380653 4.307743
H  -1.904414 -1.023727 3.242165
H  -5.922065 1.280132 -3.400407
H  -4.156726 1.136808 -3.509473
H  -5.148285 -0.302187 -3.184218
H  -1.385067 -1.572541 -2.240148
elementType: S O N C H
totalener: -1797.80083078 hartree
nucrepener: 3146.05812747 hartree
electener: -4943.85895824 hartree
oneelecener: -8721.17407370 hartree
twoeener: 3777.31511546 hartree
cpcmener: -0.03597183 hartree
kineticenergy: 1791.37536513 hartree
xcener: -147.481517662040 hartree
chargesum: 0.0000000
charge: 0.879505 -0.478967 -0.480262 -0.283651 -0.443830 -0.449780 -0.287982 -0.291062 0.184857 -0.210629 -0.315036 -0.137814 -0.412315 -0.418782 -0.117065 -0.063835 -0.061911 -0.152202 0.490534 0.355454 0.038193 0.351185 -0.232215 0.415509 0.418106 -0.324072 -0.127865 -0.116474 0.162702 0.226901 0.126421 0.131764 0.115285 0.111131 0.092501 0.052376 0.100661 0.094039 0.143015 0.107556 0.138845 0.118992 0.131461 0.113471 0.113816 0.191467
qa: 0.8795 -0.4790 -0.4803 -0.2837 -0.4438 -0.4498 -0.2880 -0.2911 0.1849 -0.2106 -0.3150 -0.1378 -0.4123 -0.4188 -0.1171 -0.0638 -0.0619 -0.1522 0.4905 0.3555 0.0382 0.3512 -0.2322 0.4155 0.4181 -0.3241 -0.1279 -0.1165 0.1627 0.2269 0.1264 0.1318 0.1153 0.1111 0.0925 0.0524 0.1007 0.0940 0.1430 0.1076 0.1388 0.1190 0.1315 0.1135 0.1138 0.1915
va: 5.8898 2.0131 2.0209 2.1432 2.0416 2.0601 2.1380 2.1314 3.3754 3.0785 2.9011 3.1849 2.9560 2.9592 4.0870 3.6360 4.1121 3.8514 4.1185 4.4130 3.8565 4.2542 3.9117 3.9726 4.0119 3.9226 3.8407 3.8497 1.0091 1.0505 0.9987 0.9932 1.0102 0.9963 1.0091 1.0173 1.0094 1.0052 1.0179 1.0003 0.9953 0.9910 0.9937 0.9957 0.9954 1.0176
dispcorr: -0.027679373 hartree
energy: -1797.828510148250
dipole: -10.21173 8.23330 -1.97843 13.97405 -11.93347 2.04058 -5.11242 3.86390 -1.24853
magnitude: 3.10434 au
magnitude: 7.89062 debye
