program: Orca
programVersion: 4.2.1
elementType: S O O O O O O O N N N N N N C C C C C C C C C C C C C C H H H H H H H H H H H H H H H H H H
charge: 0
multiplicity: 1
keywords: wb97x-d3
keywords: def2-TZVPP
keywords: def2/J RIJCOSX GRIDX6 NOFINALGRIDX
keywords: grid4 nofinalgrid
keywords: scfconv7
keywords: smallprint printgap noloewdin
keywords: NOSOSCF
formula: C14H18N6O7S
InChI: InChI=1S/C14H18N6O7S/c1-5-27-12(21)8-7-15-20(2)11(8)28(23,24)19-14(22)18-13-16-9(25-3)6-10(17-13)26-4/h6-7,18-19H,5H2,1-4H3
46 atoms
S  1.863047 -0.568548 1.615695
O  1.882802 0.782096 2.129611
O  2.283875 -1.662036 2.459397
O  0.934158 1.589495 -0.5414
O  2.350056 2.211843 -2.15787
O  0.709203 -2.754988 0.01608
O  -2.909379 2.077408 1.73435
O  -5.296161 -0.063275 -1.621902
N  3.752801 -1.548867 -0.127165
N  0.308636 -0.810095 1.112204
N  4.374922 -1.302622 -1.26936
N  -1.321439 -1.787569 -0.212392
N  -2.092254 0.170402 0.777592
N  -3.312862 -0.936122 -0.908608
C  2.80629 -0.62384 0.126341
C  2.826503 0.280443 -0.92874
C  3.835752 -0.210224 -1.763727
C  4.156746 -2.725971 0.62411
C  2.026161 1.462986 -1.267583
C  -0.048051 -1.851976 0.298023
C  0.058022 2.698143 -0.814167
C  -2.280193 -0.802494 -0.099028
C  -0.862168 2.434045 -1.982093
C  -3.041489 1.099082 0.857845
C  -4.243193 0.005436 -0.831522
C  -4.166104 1.077339 0.051957
C  -1.839753 2.031105 2.675608
C  -5.392942 -1.139867 -2.551584
H  4.171684 0.194371 -2.705271
H  -0.386425 -0.066359 1.271472
H  3.307438 -3.375642 0.808007
H  4.625677 -2.44872 1.563792
H  4.879927 -3.248662 0.007463
H  0.640265 3.607453 -0.966962
H  -0.511973 2.828705 0.103201
H  -1.576362 3.254689 -2.058613
H  -0.325396 2.371772 -2.927767
H  -1.432704 1.514591 -1.851403
H  -4.935399 1.833193 0.112622
H  -1.862828 1.115912 3.267769
H  -0.863111 2.131326 2.199366
H  -1.98966 2.883572 3.332472
H  -5.429718 -2.106112 -2.048591
H  -6.324811 -0.979837 -3.087422
H  -4.565557 -1.134622 -3.261221
H  -1.54852 -2.534025 -0.856846
elementType: S O N C H
totalener: -1797.79884477 hartree
nucrepener: 3154.65284948 hartree
electener: -4952.45169425 hartree
oneelecener: -8737.00468085 hartree
twoeener: 3784.55298660 hartree
cpcmener: -0.03748988 hartree
kineticenergy: 1791.37182190 hartree
xcener: -147.482653941642 hartree
chargesum: 0.0000000
charge: 0.875398 -0.485175 -0.482574 -0.277295 -0.450448 -0.454244 -0.288097 -0.288554 0.190041 -0.185821 -0.316259 -0.131943 -0.407464 -0.417765 -0.118605 -0.065972 -0.053436 -0.153118 0.482497 0.366739 0.006533 0.343977 -0.260709 0.383787 0.414367 -0.301985 -0.108714 -0.115813 0.158266 0.201920 0.126630 0.131594 0.114839 0.114684 0.112576 0.108884 0.106770 0.073782 0.143423 0.130495 0.083740 0.140936 0.114306 0.131214 0.114330 0.192264
qa: 0.8754 -0.4852 -0.4826 -0.2773 -0.4504 -0.4542 -0.2881 -0.2886 0.1900 -0.1858 -0.3163 -0.1319 -0.4075 -0.4178 -0.1186 -0.0660 -0.0534 -0.1531 0.4825 0.3667 0.0065 0.3440 -0.2607 0.3838 0.4144 -0.3020 -0.1087 -0.1158 0.1583 0.2019 0.1266 0.1316 0.1148 0.1147 0.1126 0.1089 0.1068 0.0738 0.1434 0.1305 0.0837 0.1409 0.1143 0.1312 0.1143 0.1923
va: 5.8857 2.0076 2.0190 2.1275 2.0620 2.0612 2.1274 2.1389 3.3630 3.0761 2.9006 3.1896 2.9284 2.9470 4.0701 3.6639 4.1082 3.8487 4.1622 4.4019 3.8257 4.2439 3.9025 3.9937 4.0152 3.9328 3.8439 3.8490 1.0124 1.0777 1.0015 0.9921 1.0100 1.0154 0.9900 1.0049 1.0165 1.0074 1.0172 0.9905 0.9917 0.9950 0.9952 0.9942 0.9953 1.0171
dispcorr: -0.029239942 hartree
energy: -1797.828084712192
dipole: -13.08067 9.80897 -3.27169 6.30093 -6.15641 0.14452 -6.71336 6.32275 -0.39060
magnitude: 3.29810 au
magnitude: 8.38309 debye
