program: Orca
programVersion: 4.2.1
elementType: S O O O O O O O N N N N N N C C C C C C C C C C C C C C H H H H H H H H H H H H H H H H H H
charge: 0
multiplicity: 1
keywords: wb97x-d3
keywords: def2-TZVPP
keywords: def2/J RIJCOSX GRIDX6 NOFINALGRIDX
keywords: grid4 nofinalgrid
keywords: scfconv7
keywords: smallprint printgap noloewdin
keywords: NOSOSCF
formula: C14H18N6O7S
InChI: InChI=1S/C14H18N6O7S/c1-5-27-12(21)8-7-15-20(2)11(8)28(23,24)19-14(22)18-13-16-9(25-3)6-10(17-13)26-4/h6-7,18-19H,5H2,1-4H3
46 atoms
S  1.752713 -0.816227 1.5679
O  1.745913 0.438918 2.282689
O  2.215407 -2.015455 2.22527
O  2.166276 2.564503 -1.607448
O  0.684506 1.640047 -0.204597
O  0.630444 -2.879658 -0.18767
O  -3.003217 1.90739 1.639556
O  -5.561858 -0.423751 -1.452508
N  3.642316 -1.444486 -0.347871
N  0.198821 -1.024649 1.047599
N  4.226005 -0.984485 -1.443864
N  -1.423524 -1.952122 -0.326486
N  -2.192382 -0.004016 0.684846
N  -3.493443 -1.196698 -0.87882
C  2.679427 -0.608268 0.081519
C  2.646838 0.464721 -0.798355
C  3.645941 0.162007 -1.729505
C  4.103207 -2.712766 0.191227
C  1.724599 1.604206 -0.813738
C  -0.142239 -2.013015 0.160871
C  1.358845 3.745861 -1.76297
C  -2.40784 -1.000536 -0.155444
C  1.515991 4.702874 -0.604877
C  -3.163492 0.89577 0.808703
C  -4.452387 -0.291049 -0.7496
C  -4.348153 0.807155 0.096298
C  -1.793977 2.007778 2.389689
C  -5.691347 -1.539644 -2.32951
H  3.948512 0.727019 -2.59678
H  -0.473387 -0.255762 1.187522
H  4.595926 -2.57312 1.14938
H  4.818592 -3.108457 -0.521644
H  3.277871 -3.409085 0.29544
H  0.314414 3.468234 -1.913179
H  1.719965 4.19776 -2.68513
H  0.969555 5.619782 -0.829827
H  1.116767 4.299581 0.324921
H  2.561348 4.970709 -0.448873
H  -5.137224 1.538272 0.194752
H  -1.635387 1.13295 3.021242
H  -0.931881 2.15935 1.740949
H  -1.91591 2.881156 3.024996
H  -6.665858 -1.43143 -2.798501
H  -4.920801 -1.539555 -3.100625
H  -5.657101 -2.485141 -1.788009
H  -1.65351 -2.69019 -0.979275
elementType: S O N C H
totalener: -1797.80290904 hartree
nucrepener: 3090.09434630 hartree
electener: -4887.89725534 hartree
oneelecener: -8609.49256182 hartree
twoeener: 3721.59530648 hartree
cpcmener: -0.03422071 hartree
kineticenergy: 1791.37604623 hartree
xcener: -147.482050720374 hartree
chargesum: 0.0000000
charge: 0.875473 -0.484292 -0.483406 -0.285621 -0.449826 -0.459869 -0.289714 -0.292320 0.188706 -0.197895 -0.317132 -0.137260 -0.418267 -0.425598 -0.112279 -0.081035 -0.061812 -0.153772 0.506263 0.368533 0.044386 0.365381 -0.258488 0.419714 0.414644 -0.327450 -0.126071 -0.115454 0.163804 0.225139 0.131443 0.114842 0.127105 0.090641 0.110458 0.096537 0.089433 0.090760 0.144025 0.115238 0.109365 0.138721 0.130698 0.113082 0.113436 0.189731
qa: 0.8755 -0.4843 -0.4834 -0.2856 -0.4498 -0.4599 -0.2897 -0.2923 0.1887 -0.1979 -0.3171 -0.1373 -0.4183 -0.4256 -0.1123 -0.0810 -0.0618 -0.1538 0.5063 0.3685 0.0444 0.3654 -0.2585 0.4197 0.4146 -0.3275 -0.1261 -0.1155 0.1638 0.2251 0.1314 0.1148 0.1271 0.0906 0.1105 0.0965 0.0894 0.0908 0.1440 0.1152 0.1094 0.1387 0.1307 0.1131 0.1134 0.1897
va: 5.8966 2.0145 2.0177 2.1465 2.0357 2.0550 2.1399 2.1304 3.3647 3.0891 2.8988 3.1825 2.9696 2.9684 4.0570 3.7008 4.1057 3.8505 4.1065 4.4028 3.8378 4.2520 3.9190 3.9915 4.0240 3.9331 3.8454 3.8501 1.0076 1.0513 0.9921 1.0099 1.0015 1.0113 0.9961 1.0065 1.0099 1.0047 1.0169 0.9936 0.9945 0.9952 0.9939 0.9957 0.9955 1.0188
dispcorr: -0.025765558 hartree
energy: -1797.828674599028
dipole: -5.13337 3.39099 -1.74238 13.10811 -11.92647 1.18163 -6.57598 4.81422 -1.76177
magnitude: 2.74517 au
magnitude: 6.97767 debye
