program: Orca
programVersion: 4.2.1
elementType: S O O O O O O O N N N N N N C C C C C C C C C C C C C C H H H H H H H H H H H H H H H H H H
charge: 0
multiplicity: 1
keywords: wb97x-d3
keywords: def2-TZVPP
keywords: def2/J RIJCOSX GRIDX6 NOFINALGRIDX
keywords: grid4 nofinalgrid
keywords: scfconv7
keywords: smallprint printgap noloewdin
keywords: NOSOSCF
formula: C14H18N6O7S
InChI: InChI=1S/C14H18N6O7S/c1-5-27-12(21)8-7-15-20(2)11(8)28(23,24)19-14(22)18-13-16-9(25-3)6-10(17-13)26-4/h6-7,18-19H,5H2,1-4H3
46 atoms
S  1.821381 -1.432107 1.296581
O  1.806861 -0.612085 2.484904
O  2.32336 -2.783618 1.370433
O  1.637286 2.830431 -0.693556
O  0.652409 1.500936 0.809776
O  0.753925 -2.552097 -1.176157
O  -2.989099 0.973958 2.433697
O  -5.250893 0.53312 -1.594282
N  3.703354 -1.1109 -0.696713
N  0.262442 -1.44163 0.741571
N  4.182821 -0.240083 -1.572643
N  -1.298947 -1.63769 -0.968196
N  -2.129343 -0.338302 0.771514
N  -3.280988 -0.571255 -1.273177
C  2.693199 -0.582747 0.016642
C  2.509129 0.718178 -0.434569
C  3.478776 0.862165 -1.433767
C  4.286386 -2.441465 -0.668253
C  1.50301 1.70011 -0.022223
C  -0.040122 -1.927186 -0.506785
C  0.695178 3.883344 -0.423638
C  -2.275872 -0.81066 -0.453188
C  1.016497 5.033781 -1.3408
C  -3.081062 0.476548 1.215626
C  -4.222271 0.243595 -0.819623
C  -4.179318 0.819871 0.444609
C  -1.899279 0.583364 3.266234
C  -5.314305 -0.040807 -2.897292
H  3.684261 1.722482 -2.050469
H  -0.427422 -0.824509 1.194527
H  3.5415 -3.191514 -0.916025
H  4.724114 -2.657591 0.301457
H  5.067743 -2.450824 -1.420365
H  0.773734 4.183191 0.622975
H  -0.319261 3.518515 -0.595403
H  0.925156 4.752304 -2.389837
H  0.311454 5.843442 -1.152379
H  2.020614 5.421032 -1.168581
H  -4.952617 1.481832 0.805408
H  -0.944005 0.923218 2.866671
H  -2.072475 1.070531 4.222198
H  -1.874723 -0.496037 3.419116
H  -6.223164 0.351674 -3.34554
H  -4.459464 0.247959 -3.508687
H  -5.375422 -1.128393 -2.856657
H  -1.485623 -1.985366 -1.900042
elementType: S O N C H
totalener: -1797.80282584 hartree
nucrepener: 3102.17986288 hartree
electener: -4899.98268871 hartree
oneelecener: -8633.48432270 hartree
twoeener: 3733.50163399 hartree
cpcmener: -0.03572734 hartree
kineticenergy: 1791.38142915 hartree
xcener: -147.481924519679 hartree
chargesum: 0.0000000
charge: 0.880326 -0.481730 -0.482088 -0.279461 -0.449924 -0.454178 -0.288683 -0.292039 0.186693 -0.208122 -0.315464 -0.139156 -0.415460 -0.423413 -0.112362 -0.067259 -0.060550 -0.152466 0.500771 0.361914 0.037452 0.360961 -0.253322 0.417745 0.414640 -0.324705 -0.128106 -0.115912 0.161920 0.226611 0.127745 0.130515 0.114934 0.099398 0.095615 0.089328 0.090948 0.089367 0.144087 0.106408 0.138831 0.119062 0.131393 0.112828 0.113918 0.190991
qa: 0.8803 -0.4817 -0.4821 -0.2795 -0.4499 -0.4542 -0.2887 -0.2920 0.1867 -0.2081 -0.3155 -0.1392 -0.4155 -0.4234 -0.1124 -0.0673 -0.0605 -0.1525 0.5008 0.3619 0.0375 0.3610 -0.2533 0.4177 0.4146 -0.3247 -0.1281 -0.1159 0.1619 0.2266 0.1277 0.1305 0.1149 0.0994 0.0956 0.0893 0.0909 0.0894 0.1441 0.1064 0.1388 0.1191 0.1314 0.1128 0.1139 0.1910
va: 5.8891 2.0125 2.0196 2.1469 2.0377 2.0573 2.1383 2.1303 3.3700 3.0836 2.9018 3.1831 2.9634 2.9665 4.0775 3.6779 4.1052 3.8501 4.0960 4.4065 3.8443 4.2547 3.9725 3.9906 4.0242 3.9388 3.8421 3.8496 1.0089 1.0505 0.9995 0.9935 1.0102 0.9960 0.9958 1.0026 1.0065 1.0029 1.0168 1.0005 0.9956 0.9908 0.9935 0.9959 0.9954 1.0179
dispcorr: -0.025707359 hartree
energy: -1797.828533194084
dipole: -6.55805 4.61668 -1.94137 15.88738 -14.11405 1.77334 -7.42916 5.93011 -1.49904
magnitude: 3.02667 au
magnitude: 7.69319 debye
