program: Gaussian 09
title: 000069135
version: EM64L-G09RevD.01
frameworkgroup: C1[X(C4H3N3O4)]
method: RPBEPBE
basis: SDD
operation: Freq
keyword: #pfreq=noraman
keyword: PBEPBE/SDD
title: #p freq=noraman PBEPBE/SDD
converged: NO NO NO NO
title: Mulliken charges:
elementType: O O O O N N N C C C C H H H
charge: -0.178673 -0.214906 -0.235146 -0.154765 -0.408717 -0.338060 0.048265 0.229869 0.190625 -0.185017 0.180091 0.318592 0.379329 0.368513
chargesum: 0.00000
title: Mulliken charges with hydrogens summed into heavy atoms:
elementType: O O O O N N N C C C C
charge: -0.178673 -0.214906 -0.235146 -0.154765 -0.029387 0.030453 0.048265 0.229869 0.190625 0.133575 0.180091
polarizability: 1.23009206e+02 9.55908985e+00 9.08380467e+01 -1.10092919e-03 8.55932980e-03 3.05480161e+01
1716.lowfreq: -16.0535 -11.6724 -9.0035 -5.6126 -0.0011 -0.0010 -0.0010 83.3921 151.2629
frequency: -16.0520 83.3728 151.2624 211.9965 266.4525 331.3661 362.2087 412.5028 419.0325 518.0055 594.0504 604.4591 648.4450 668.9396 705.8699 738.4453 746.1198 772.3224 785.7150 930.9745 966.2731 1054.4840 1144.7707 1183.8513 1220.2217 1296.9702 1351.0274 1371.5189 1380.9341 1461.8083 1605.0488 1669.1995 1693.1478 3182.3637 3517.0485 3549.3528
redmass: 14.8193 8.0410 8.3988 12.0514 8.5926 14.5459 12.8059 3.2424 12.1356 8.9347 7.8232 6.2397 4.2351 1.7618 2.0763 9.1942 3.5077 9.8051 2.2684 3.3756 1.3636 6.2408 4.5325 2.3973 5.7859 2.5262 3.5833 3.3528 1.9014 2.6786 6.3425 8.4633 5.8001 1.0944 1.0772 1.0793
irintensity: 0.6041 6.8835 4.6395 2.5330 0.0000 5.7656 12.4185 13.8082 8.2941 5.5290 23.9980 5.9169 1.1560 76.7445 0.8207 3.4534 33.9471 17.7542 177.4943 6.1456 10.1823 9.4047 23.5095 220.1180 240.0348 74.8367 93.2028 32.0191 47.6708 63.6966 38.3662 359.5550 702.4503 6.5553 71.3264 124.2374
temp: 298.150 k
press: 1.00000 atm
elementType: 8 8 8 8 7 7 7 6 6 6 6 1 1 1
symmnumber: 1
zpe: 224895.3 jmol-1
zpe.correction: 0.085658 hartree
zpe.thermalcorrener: 0.093714 hartree
zpe.thermalcorrenthalpy: 0.094658 hartree
zpe.thermalcorrgfe: 0.052133 hartree
zpe.sumelectzpe: -618.514485 hartree
zpe.sumelectthermal: -618.506429 hartree
zpe.sumelectthermalent: -618.505485 hartree
zpe.sumelectthermalfe: -618.548010 hartree
dipole: -3.9013 -3.7899 0.0012
dipole: 5.4391
quadrupole: -84.9443 -59.2175 -60.3733
quadrupole: -0.1714 0.0022 -0.0040
quadrupole: -16.7659 8.9609 7.8051 -0.1714 0.0022 -0.0040
hfenergy: -618.6001432 hartree
pointgroup: C01 [X(C4H3N3O4)]
dipole: -1.5593603 1.4654439 -0.0004794 debye
dipolederiv: -0.4937545 0.1006882 -0.0000561 0.2586872 -0.9729781 0.0000905 -0.0000874 0.0001078 -0.3214216 -1.3898466 0.084845 0.0000083 -0.0572308 -0.4758894 0.0000153 0.0000247 0.000007 -0.3673943 -0.6757682 -0.1950551 -0.0000573 -0.309027 -0.7285002 -0.0002593 -0.0003316 -0.0005504 -0.2510929 -0.646197 0.2071264 0.0002544 0.1357895 -0.5131498 -0.0004657 -0.0000211 -0.0001661 -0.1883248 -1.1109647 0.3819446 -0.0000666 0.3506278 -0.5833207 0.0000188 -0.0000108 0.0000223 -0.3642957 -1.4563382 0.1937576 -0.0000191 -0.5436336 -0.4709518 0.0000376 0.0000768 0.0000086 -0.3003142 1.86014 0.0801621 -0.0001218 0.1692157 1.0318747 0.0008673 0.0000928 0.0007664 0.2055552 -0.9991583 -0.0816161 -0.0000507 0.3556086 -0.6621297 -0.0000411 0.0001873 -0.0000006 -0.0547217 1.1925075 -0.1384976 0.0000689 -0.1170769 1.35978 -0.0001887 0.0001934 -0.0002039 0.3207891 1.213419 -0.5071719 0.0000334 -0.5170538 0.2772849 -0.0000456 -0.0001005 0.0000194 0.0815702 2.002072 -0.1106622 -0.0000109 0.3681123 1.1295323 -0.0000625 -0.0000775 -0.0000515 0.3541366 0.1411957 -0.0313954 0.0000109 -0.0135369 0.1041261 0.0000217 0.0000641 0.000005 0.1812 0.1641193 0.0540756 0.0000007 0.0411946 0.2276794 0.0000118 -0.0000169 0.0000331 0.3493051 0.198574 -0.0382011 0.0000059 -0.1216768 0.2766423 -0.0000002 0.0000069 0.0000029 0.3550092 unknown
polarizability: 123.3168736|-9.0212816|90.5303792|0.0009591|0.0085764|30.5480161 unknown
InChI: InChI=1S/C4H3N3O4/c8-3-2(7(10)11)1-5-4(9)6-3/h1,5-6H
charge 0 multiplicity 1
14 atoms
O  0.522412 -2.265685 0.000253
O  -3.485165 0.1464 0.000045
O  2.584157 1.575809 0.000967
O  2.855742 -0.690498 -0.000685
N  -1.432745 -1.009124 0.00007
N  -1.465903 1.338475 -0.000052
N  2.119145 0.35981 -0.000306
C  0.655586 0.203192 -0.000111
C  0.004441 -1.126113 0.000067
C  -0.096601 1.36294 -0.000107
C  -2.232141 0.13642 0.000034
H  0.411183 2.331211 -0.000156
H  -1.935948 -1.903439 0.000167
H  -2.011962 2.203502 -0.000085
