program: Orca
programVersion: 4.2.1
elementType: S O O O O O O O N N N N N N C C C C C C C C C C C C C C H H H H H H H H H H H H H H H H H H
charge: 0
multiplicity: 1
keywords: wb97x-d3
keywords: def2-TZVPP
keywords: def2/J RIJCOSX GRIDX6 NOFINALGRIDX
keywords: grid4 nofinalgrid
keywords: scfconv7
keywords: smallprint printgap noloewdin
keywords: NOSOSCF
formula: C14H18N6O7S
InChI: InChI=1S/C14H18N6O7S/c1-5-27-12(21)8-7-15-20(2)11(8)28(23,24)19-14(22)18-13-16-9(25-3)6-10(17-13)26-4/h6-7,18-19H,5H2,1-4H3
46 atoms
S  1.843382 -0.972345 -1.510098
O  2.311193 -2.258807 -1.968006
O  1.880568 0.161207 -2.403436
O  1.788291 2.561107 1.598904
O  0.720284 1.70968 -0.171199
O  0.66115 -2.738406 0.495483
O  -2.943626 1.648322 -2.197141
O  -5.573351 -0.156772 1.173576
N  3.687514 -1.311552 0.515623
N  0.271066 -1.09049 -1.014755
N  4.177601 -0.746862 1.609637
N  -1.392606 -1.80254 0.43818
N  -2.143247 -0.059911 -0.907019
N  -3.48087 -0.986366 0.800089
C  2.706042 -0.566381 -0.023257
C  2.556382 0.556214 0.780698
C  3.512504 0.373849 1.786585
C  4.241913 -2.588372 0.100645
C  1.591465 1.651381 0.66123
C  -0.100148 -1.936693 -0.00166
C  0.896004 3.688091 1.639083
C  -2.376567 -0.902998 0.083172
C  1.289948 4.540983 2.816841
C  -3.119569 0.789952 -1.21145
C  -4.444624 -0.131353 0.4895
C  -4.326201 0.804652 -0.531214
C  -1.707144 1.64849 -2.908321
C  -5.713597 -1.096067 2.235805
H  3.732368 1.01304 2.626789
H  -0.399042 -0.364567 -1.306579
H  4.992869 -2.851355 0.837704
H  4.713787 -2.512877 -0.874644
H  3.473365 -3.354759 0.083118
H  -0.133182 3.337266 1.737831
H  0.974468 4.248049 0.705047
H  1.205006 3.994334 3.756458
H  2.309019 4.916726 2.721966
H  0.622413 5.400968 2.87167
H  -5.1192 1.495542 -0.777763
H  -1.514406 0.686832 -3.385261
H  -1.813754 2.407106 -3.679286
H  -0.872525 1.917106 -2.261228
H  -5.645422 -2.123751 1.878736
H  -4.969296 -0.93742 3.016408
H  -6.704883 -0.925894 2.647806
H  -1.640659 -2.427428 1.194298
elementType: S O N C H
totalener: -1797.80388353 hartree
nucrepener: 3083.52939297 hartree
electener: -4881.33327650 hartree
oneelecener: -8596.25504621 hartree
twoeener: 3714.92176971 hartree
cpcmener: -0.03574245 hartree
kineticenergy: 1791.37843402 hartree
xcener: -147.481967592043 hartree
chargesum: 0.0000000
charge: 0.875571 -0.482022 -0.481747 -0.278450 -0.455240 -0.456664 -0.289268 -0.292438 0.186169 -0.202593 -0.315589 -0.137576 -0.419084 -0.426432 -0.108777 -0.069853 -0.060476 -0.152600 0.505848 0.363261 0.037023 0.366857 -0.253666 0.417210 0.415365 -0.326769 -0.130092 -0.114977 0.162235 0.228245 0.115083 0.131254 0.126525 0.096879 0.099135 0.088632 0.089248 0.091207 0.144593 0.114392 0.138823 0.113453 0.112866 0.113173 0.131409 0.189856
qa: 0.8756 -0.4820 -0.4817 -0.2785 -0.4552 -0.4567 -0.2893 -0.2924 0.1862 -0.2026 -0.3156 -0.1376 -0.4191 -0.4264 -0.1088 -0.0699 -0.0605 -0.1526 0.5058 0.3633 0.0370 0.3669 -0.2537 0.4172 0.4154 -0.3268 -0.1301 -0.1150 0.1622 0.2282 0.1151 0.1313 0.1265 0.0969 0.0991 0.0886 0.0892 0.0912 0.1446 0.1144 0.1388 0.1135 0.1129 0.1132 0.1314 0.1899
va: 5.8954 2.0200 2.0134 2.1473 2.0329 2.0569 2.1400 2.1300 3.3695 3.0868 2.9022 3.1839 2.9675 2.9684 4.0737 3.6869 4.1036 3.8517 4.0926 4.4078 3.8434 4.2501 3.9732 3.9967 4.0262 3.9342 3.8404 3.8497 1.0086 1.0462 1.0103 0.9929 0.9995 0.9966 0.9958 1.0028 1.0028 1.0065 1.0167 0.9922 0.9949 1.0012 0.9957 0.9958 0.9935 1.0188
dispcorr: -0.025311797 hartree
energy: -1797.829195328010
dipole: -6.00183 4.09775 -1.90407 13.24261 -11.95389 1.28873 11.09711 -9.31062 1.78649
magnitude: 2.91168 au
magnitude: 7.40090 debye
