program: Gaussian 09
title: 000069136
version: EM64L-G09RevD.01
frameworkgroup: C1[X(C8H12O3)]
method: RPBEPBE
basis: SDD
operation: Freq
keyword: #pfreq=noraman
keyword: PBEPBE/SDD
title: #p freq=noraman PBEPBE/SDD
converged: YES YES NO NO
title: Mulliken charges:
elementType: O O O C C C C C C C C H H H H H H H H H H H H
charge: -0.254429 -0.167821 -0.239135 -0.286061 -0.468840 -0.420062 -0.496505 0.134091 0.237752 -0.222140 -0.673675 0.286672 0.248591 0.233695 0.229654 0.214740 0.249130 0.258344 0.233532 0.226167 0.210811 0.227249 0.238239
chargesum: 0.00000
title: Mulliken charges with hydrogens summed into heavy atoms:
elementType: O O O C C C C C C C C
charge: -0.254429 -0.167821 -0.239135 0.000611 0.013447 0.024332 0.010969 0.134091 0.237752 0.237559 0.002624
polarizability: 1.18779484e+02 2.66246387e+00 8.60763990e+01 -6.30372074e-01 -6.99416214e-01 7.47627691e+01
1716.lowfreq: -1.1487 0.0004 0.0010 0.0012 6.6812 10.0804 30.0932 58.4323 62.6219
frequency: 29.7948 58.2198 62.5460 95.4649 130.1528 179.4216 203.2839 254.9252 276.1934 311.5321 378.8938 435.3956 483.9037 556.4524 592.4114 639.2867 720.1846 755.8253 799.6594 810.9089 828.8867 900.4670 907.4165 926.6884 983.3584 1018.8455 1027.6075 1074.5417 1099.1885 1114.7986 1125.8778 1135.7679 1152.1368 1166.6124 1198.4685 1244.1612 1249.8243 1271.4012 1285.8850 1311.7609 1324.0371 1357.6668 1401.0540 1427.9240 1462.9551 1473.6246 1477.4401 1484.5679 1486.2290 1626.9275 1667.4798 2987.9885 2996.7758 3006.7763 3011.8003 3012.2865 3015.8748 3071.2515 3073.2646 3078.7568 3089.9143 3093.3424 3109.5031
redmass: 3.6312 3.4027 3.0549 3.4651 3.2303 2.4621 2.2207 1.5446 3.0119 4.5498 3.7336 3.7993 3.5394 3.5262 2.5911 4.9800 4.7970 3.6474 1.1052 3.4803 2.0254 1.7190 2.3136 2.8291 1.7942 1.9735 2.1101 1.9055 3.0911 2.3520 4.3016 1.4679 1.6473 1.6129 1.4518 1.3249 1.1433 1.3657 1.5328 1.3536 1.5432 1.4310 1.2653 1.0805 1.0398 1.0631 1.0809 1.0939 1.0670 9.8477 12.5293 1.0659 1.0359 1.0639 1.0601 1.0738 1.0687 1.1065 1.0964 1.0994 1.1043 1.0985 1.1027
irintensity: 2.2208 4.1848 3.7352 0.8901 0.9730 2.8194 4.0791 1.8758 3.5119 7.9986 5.0630 5.3188 1.8857 7.5708 2.6317 10.4756 1.6829 1.7048 4.4635 3.8951 25.9603 0.7764 5.0449 45.3210 6.7056 49.9688 22.9981 9.3586 277.5662 15.3912 43.9524 5.1835 31.6869 86.5889 11.2260 64.9686 4.4938 1.9783 98.4609 6.4497 27.0375 7.2796 22.2166 21.8804 12.3447 3.8899 14.7290 6.4231 14.6745 225.4873 127.1412 8.2502 21.1868 37.9323 15.5158 2.3968 19.9479 6.5967 17.1773 18.7472 30.5322 30.5014 40.6515
temp: 298.150 k
press: 1.00000 atm
elementType: 8 8 8 6 6 6 6 6 6 6 6 1 1 1 1 1 1 1 1 1 1 1 1
symmnumber: 1
zpe: 493672.5 jmol-1
zpe.correction: 0.188030 hartree
zpe.thermalcorrener: 0.199595 hartree
zpe.thermalcorrenthalpy: 0.200539 hartree
zpe.thermalcorrgfe: 0.149076 hartree
zpe.sumelectzpe: -536.866429 hartree
zpe.sumelectthermal: -536.854864 hartree
zpe.sumelectthermalent: -536.853920 hartree
zpe.sumelectthermalfe: -536.905383 hartree
dipole: -0.7784 -1.3337 -1.9023
dipole: 2.4501
quadrupole: -48.4880 -73.4306 -66.9575
quadrupole: 1.2095 0.7638 2.0488
quadrupole: 14.4707 -10.4719 -3.9988 1.2095 0.7638 2.0488
hfenergy: -537.0544591 hartree
pointgroup: C01 [X(C8H12O3)]
dipole: 0.1878505 0.9391416 -0.1093054 debye
dipolederiv: -1.5930274 -0.1759246 -0.3445804 -0.2529682 -0.2966071 0.0242747 -0.4358464 0.01789 -0.5780764 -0.4975078 -0.1490171 -0.1181372 0.0268433 -0.7786814 -0.3514604 -0.0273784 -0.2919956 -0.4941353 -0.6911658 -0.0722941 0.0851768 -0.0941571 -0.3108155 0.2029186 -0.1482534 0.0156898 -0.9301903 -0.7502797 0.1789241 0.2645025 0.2103269 -0.2130403 -0.1733994 0.2600302 -0.1089735 -0.0789723 0.043635 0.0303886 0.0308135 0.0024676 0.1201647 -0.0405868 0.1082918 0.0463434 0.0556935 0.0298338 -0.013398 0.0340339 0.0241146 0.0851284 -0.0273961 -0.0190369 -0.064918 0.1528582 -0.4560351 -0.0541565 -0.1345798 0.1178393 -0.0053153 -0.0585262 -0.0993662 -0.1005723 0.0379104 1.0552504 -0.0320322 0.1011929 -0.4566947 0.8713933 0.5701267 -0.0098928 0.4420836 0.4034212 1.8254021 0.1408215 0.0583077 0.3131615 0.1536947 -0.2955465 0.4275191 -0.089671 1.2283342 0.8895124 0.1005147 0.0736396 0.1835997 0.3703355 0.0576458 -0.0717145 0.0241129 0.2468356 -0.0910447 -0.0146382 -0.082369 -0.0315201 0.0581505 -0.0151557 -0.0687918 -0.0160299 -0.0187281 0.1058539 0.0067542 -0.0373373 -0.0051688 0.0582764 0.0386777 -0.0420551 0.0208181 -0.021147 0.0786096 0.0040949 0.0130772 0.0097728 0.0722514 0.0857194 -0.010821 0.0290686 -0.0669123 0.0377456 0.0624109 0.0111559 0.0376919 -0.1532918 -0.0429549 -0.0047688 -0.0135886 0.0867507 -0.1068799 -0.0648164 -0.0933656 -0.040332 0.0582724 -0.0271359 -0.1256986 -0.0538464 -0.0008821 0.0674193 0.0054261 0.0161881 -0.0272714 -0.0361389 0.0881497 0.0785819 0.1189404 -0.0887722 0.0803751 -0.0152312 -0.0056141 -0.0237583 0.0036173 0.0604148 -0.0416214 0.0999633 0.0048678 0.0085275 0.0313383 0.0766172 0.0093814 0.0426471 -0.0684381 0.1026849 -0.0664223 -0.0004359 -0.0481045 0.0496288 -0.0455661 -0.022199 -0.0865726 0.0607581 0.0229205 0.0665621 0.0416601 -0.0547847 -0.0152926 -0.0017452 -0.0028877 -0.0077306 -0.1104572 0.0855299 -0.075944 -0.0515389 -0.1304481 -0.0847191 0.0421913 -0.0949334 0.0770392 0.0310137 0.0609756 0.0396211 0.0582777 0.1066112 0.0193724 -0.0143955 0.0648455 -0.1108122 0.0871204 -0.0519058 0.0561602 0.0540267 0.090502 0.0618456 0.0707934 0.0518462 0.0280347 -0.0957627 0.0106173 -0.095292 -0.0408452 unknown
polarizability: 117.660104|6.2621663|80.1871177|2.5236382|5.9802506|81.7714308 unknown
InChI: InChI=1S/C8H12O3/c1-2-11-8(10)6-4-3-5-7(6)9/h6H,2-5H2,1H3
charge 0 multiplicity 1
23 atoms
O  -1.926048 0.408816 -0.22711
O  0.809308 -1.29123 -1.198679
O  -0.903277 0.115856 1.84904
C  0.409456 0.916175 -0.080601
C  1.393076 1.724431 0.797657
C  2.792058 1.44704 0.177524
C  2.729862 -0.041333 -0.232835
C  1.260924 -0.296413 -0.594423
C  -0.842438 0.450887 0.642314
C  -3.199585 -0.148347 0.330513
C  -4.208729 -0.16245 -0.812246
H  0.100431 1.479157 -0.982677
H  1.342716 1.338921 1.832672
H  1.145774 2.798836 0.824663
H  3.609087 1.660683 0.88684
H  2.949556 2.081874 -0.714709
H  2.97396 -0.699967 0.62592
H  3.393878 -0.333614 -1.063835
H  -2.987547 -1.158913 0.723014
H  -3.516719 0.491708 1.173823
H  -5.16993 -0.57683 -0.45713
H  -4.389752 0.856911 -1.194057
H  -3.846161 -0.787899 -1.64538
