program: Orca
programVersion: 4.2.1
elementType: S O O O O O O O N N N N N N C C C C C C C C C C C C C C H H H H H H H H H H H H H H H H H H
charge: 0
multiplicity: 1
keywords: wb97x-d3
keywords: def2-TZVPP
keywords: def2/J RIJCOSX GRIDX6 NOFINALGRIDX
keywords: grid4 nofinalgrid
keywords: scfconv7
keywords: smallprint printgap noloewdin
keywords: NOSOSCF
formula: C14H18N6O7S
InChI: InChI=1S/C14H18N6O7S/c1-5-27-12(21)8-7-15-20(2)11(8)28(23,24)19-14(22)18-13-16-9(25-3)6-10(17-13)26-4/h6-7,18-19H,5H2,1-4H3
46 atoms
S  1.846605 -0.952792 -1.514784
O  2.337543 -2.220939 -1.998865
O  1.880296 0.20659 -2.375028
O  1.848211 2.603258 1.555063
O  0.691469 1.694102 -0.129182
O  0.651293 -2.788055 0.423857
O  -2.938859 1.689837 -2.142679
O  -5.560881 -0.183599 1.196068
N  3.654991 -1.332298 0.538155
N  0.267762 -1.103715 -1.048283
N  4.142539 -0.774785 1.636721
N  -1.403834 -1.854626 0.377836
N  -2.147381 -0.067139 -0.912174
N  -3.48237 -1.029175 0.777295
C  2.688744 -0.573085 -0.009598
C  2.547344 0.55069 0.794261
C  3.489955 0.354157 1.809885
C  4.200878 -2.61316 0.124303
C  1.597189 1.657878 0.667328
C  -0.108377 -1.974963 -0.057138
C  0.97244 3.744293 1.587507
C  -2.381724 -0.935604 0.055511
C  1.453188 4.658733 2.684557
C  -3.115912 0.803787 -1.181713
C  -4.438126 -0.152379 0.50206
C  -4.316318 0.813501 -0.490069
C  -1.715445 1.686856 -2.876102
C  -5.707387 -1.159311 2.224189
H  3.71003 0.989311 2.653253
H  -0.396662 -0.362924 -1.314078
H  4.709729 -2.531798 -0.832192
H  3.420044 -3.36516 0.067251
H  4.919435 -2.900436 0.88435
H  -0.05155 3.41318 1.772841
H  0.995385 4.249466 0.619524
H  0.802719 5.532429 2.728671
H  1.421926 4.171486 3.659834
H  2.469223 5.010297 2.501852
H  -5.102801 1.521993 -0.708076
H  -1.549396 0.734833 -3.382113
H  -1.821494 2.468045 -3.624498
H  -0.864115 1.922713 -2.23777
H  -6.689812 -0.984488 2.655538
H  -5.665348 -2.173982 1.827265
H  -4.949658 -1.045998 3.000102
H  -1.652633 -2.498633 1.117959
elementType: S O N C H
totalener: -1797.80405698 hartree
nucrepener: 3081.28041598 hartree
electener: -4879.08447296 hartree
oneelecener: -8591.79289243 hartree
twoeener: 3712.70841947 hartree
cpcmener: -0.03555204 hartree
kineticenergy: 1791.35671834 hartree
xcener: -147.477586656234 hartree
chargesum: 0.0000000
charge: 0.877347 -0.482110 -0.482641 -0.278684 -0.457199 -0.457160 -0.289111 -0.292419 0.187484 -0.202056 -0.315967 -0.137993 -0.419659 -0.426240 -0.111618 -0.069913 -0.060002 -0.152859 0.507906 0.365158 0.036973 0.366412 -0.253225 0.418543 0.415623 -0.327580 -0.129974 -0.114851 0.162292 0.227180 0.131280 0.126669 0.115085 0.098034 0.098314 0.091212 0.088714 0.089244 0.144543 0.114759 0.138720 0.112575 0.131331 0.113079 0.112784 0.190003
qa: 0.8773 -0.4821 -0.4826 -0.2787 -0.4572 -0.4572 -0.2891 -0.2924 0.1875 -0.2021 -0.3160 -0.1380 -0.4197 -0.4262 -0.1116 -0.0699 -0.0600 -0.1529 0.5079 0.3652 0.0370 0.3664 -0.2532 0.4185 0.4156 -0.3276 -0.1300 -0.1149 0.1623 0.2272 0.1313 0.1267 0.1151 0.0980 0.0983 0.0912 0.0887 0.0892 0.1445 0.1148 0.1387 0.1126 0.1313 0.1131 0.1128 0.1900
va: 5.8940 2.0199 2.0134 2.1486 2.0307 2.0563 2.1397 2.1299 3.3678 3.0872 2.9017 3.1837 2.9662 2.9681 4.0684 3.6963 4.1022 3.8510 4.0870 4.4056 3.8425 4.2510 3.9731 3.9943 4.0253 3.9352 3.8410 3.8497 1.0085 1.0475 0.9926 1.0002 1.0102 0.9966 0.9959 1.0064 1.0026 1.0029 1.0167 0.9923 0.9951 1.0008 0.9936 0.9956 0.9959 1.0187
dispcorr: -0.025279070 hartree
energy: -1797.829336052379
dipole: -5.63335 3.75415 -1.87920 13.45458 -12.17085 1.28373 10.82279 -9.04537 1.77742
magnitude: 2.88767 au
magnitude: 7.33986 debye
