program: Orca
programVersion: 4.2.1
elementType: S O O O O O O O N N N N N N C C C C C C C C C C C C C C H H H H H H H H H H H H H H H H H H
charge: 0
multiplicity: 1
keywords: wb97x-d3
keywords: def2-TZVPP
keywords: def2/J RIJCOSX GRIDX6 NOFINALGRIDX
keywords: grid4 nofinalgrid
keywords: scfconv7
keywords: smallprint printgap noloewdin
keywords: NOSOSCF
formula: C14H18N6O7S
InChI: InChI=1S/C14H18N6O7S/c1-5-27-12(21)8-7-15-20(2)11(8)28(23,24)19-14(22)18-13-16-9(25-3)6-10(17-13)26-4/h6-7,18-19H,5H2,1-4H3
46 atoms
S  1.758532 -0.894875 -1.44822
O  2.197198 -2.162733 -1.981475
O  1.773666 0.280479 -2.287628
O  2.256838 2.77913 1.379683
O  0.773713 1.783467 0.031961
O  0.605245 -2.739968 0.514076
O  -3.045437 1.715262 -1.989132
O  -5.797384 -0.540746 0.989433
N  3.631133 -1.367758 0.526305
N  0.20204 -1.020316 -0.909386
N  4.229286 -0.809825 1.567797
N  -1.475705 -1.869093 0.449389
N  -2.235911 -0.056197 -0.793741
N  -3.633594 -1.210706 0.714352
C  2.690418 -0.556269 0.009741
C  2.687607 0.604131 0.771261
C  3.680743 0.375445 1.729822
C  4.055011 -2.698321 0.126424
C  1.799796 1.765336 0.667289
C  -0.167167 -1.933541 0.042625
C  1.467245 3.98151 1.420901
C  -2.486942 -0.99969 0.097048
C  2.223999 4.999423 2.234566
C  -3.239154 0.761992 -1.098541
C  -4.624052 -0.385894 0.405028
C  -4.490333 0.64689 -0.515812
C  -1.767889 1.834746 -2.612332
C  -5.962916 -1.59666 1.931976
H  4.001557 1.021912 2.531482
H  -0.475701 -0.28776 -1.165802
H  4.56934 -2.672142 -0.830555
H  3.207228 -3.372938 0.074022
H  4.742399 -3.045487 0.890368
H  0.495927 3.762393 1.869564
H  1.297401 4.342887 0.404581
H  2.39307 4.657771 3.256682
H  3.186676 5.242143 1.783141
H  1.640048 5.918864 2.284106
H  -5.305651 1.311419 -0.762935
H  -1.506373 0.935985 -3.172578
H  -1.857754 2.666741 -3.306117
H  -0.986536 2.062545 -1.887712
H  -5.290387 -1.488568 2.783224
H  -6.991018 -1.522275 2.276873
H  -5.808279 -2.574175 1.474327
H  -1.727026 -2.553269 1.151109
elementType: S O N C H
totalener: -1797.80469878 hartree
nucrepener: 3059.20110163 hartree
electener: -4857.00580042 hartree
oneelecener: -8547.72501589 hartree
twoeener: 3690.71921547 hartree
cpcmener: -0.03533293 hartree
kineticenergy: 1791.36657332 hartree
xcener: -147.479898205757 hartree
chargesum: -0.0000000
charge: 0.873744 -0.483469 -0.484617 -0.278338 -0.458397 -0.463162 -0.289963 -0.291972 0.188173 -0.196309 -0.316338 -0.137131 -0.424929 -0.426938 -0.103470 -0.073421 -0.060210 -0.155315 0.502622 0.373812 0.037836 0.370001 -0.252353 0.418409 0.414552 -0.325724 -0.129721 -0.115602 0.162969 0.226740 0.131837 0.127645 0.115195 0.100347 0.096432 0.089297 0.089604 0.090333 0.144991 0.114042 0.138380 0.112817 0.113025 0.131586 0.113045 0.189946
qa: 0.8737 -0.4835 -0.4846 -0.2783 -0.4584 -0.4632 -0.2900 -0.2920 0.1882 -0.1963 -0.3163 -0.1371 -0.4249 -0.4269 -0.1035 -0.0734 -0.0602 -0.1553 0.5026 0.3738 0.0378 0.3700 -0.2524 0.4184 0.4146 -0.3257 -0.1297 -0.1156 0.1630 0.2267 0.1318 0.1276 0.1152 0.1003 0.0964 0.0893 0.0896 0.0903 0.1450 0.1140 0.1384 0.1128 0.1130 0.1316 0.1130 0.1899
va: 5.8967 2.0187 2.0136 2.1494 2.0325 2.0528 2.1401 2.1307 3.3651 3.0917 2.8993 3.1836 2.9707 2.9674 4.0524 3.7176 4.0995 3.8509 4.0933 4.3978 3.8411 4.2477 3.9719 3.9970 4.0268 3.9318 3.8420 3.8498 1.0079 1.0465 0.9916 1.0015 1.0097 0.9965 0.9961 1.0023 1.0029 1.0065 1.0166 0.9935 0.9953 1.0005 0.9958 0.9936 0.9957 1.0188
dispcorr: -0.024884930 hartree
energy: -1797.829583713572
dipole: -3.90176 2.14239 -1.75936 13.66180 -12.44497 1.21682 9.29712 -7.67226 1.62486
magnitude: 2.68630 au
magnitude: 6.82803 debye
