program: Orca
programVersion: 4.2.1
elementType: S O O O O O O O N N N N N N C C C C C C C C C C C C C C H H H H H H H H H H H H H H H H H H
charge: 0
multiplicity: 1
keywords: wb97x-d3
keywords: def2-TZVPP
keywords: def2/J RIJCOSX GRIDX6 NOFINALGRIDX
keywords: grid4 nofinalgrid
keywords: scfconv7
keywords: smallprint printgap noloewdin
keywords: NOSOSCF
formula: C14H18N6O7S
InChI: InChI=1S/C14H18N6O7S/c1-5-27-12(21)8-7-15-20(2)11(8)28(23,24)19-14(22)18-13-16-9(25-3)6-10(17-13)26-4/h6-7,18-19H,5H2,1-4H3
46 atoms
S  1.777634 -0.893439 -1.468703
O  2.238689 -2.148909 -2.011835
O  1.794554 0.29422 -2.290487
O  2.189443 2.753323 1.397784
O  0.724849 1.740163 0.044128
O  0.605287 -2.781264 0.445485
O  -3.010945 1.753659 -1.968324
O  -5.748774 -0.483383 1.036989
N  3.622176 -1.372507 0.532609
N  0.213084 -1.042061 -0.959072
N  4.193133 -0.822941 1.59357
N  -1.467769 -1.893747 0.393481
N  -2.214938 -0.051553 -0.814432
N  -3.606555 -1.196376 0.7069
C  2.680658 -0.565439 0.010372
C  2.649299 0.583576 0.788022
C  3.627099 0.353289 1.76172
C  4.070941 -2.690758 0.119534
C  1.74856 1.734383 0.682744
C  -0.160525 -1.962712 -0.015444
C  1.385163 3.9462 1.431428
C  -2.467711 -1.000062 0.070479
C  2.126999 4.977121 2.241765
C  -3.206178 0.792064 -1.087058
C  -4.584822 -0.346133 0.42972
C  -4.447033 0.696483 -0.479119
C  -1.745256 1.856214 -2.61776
C  -5.916704 -1.546346 1.971058
H  3.922957 0.991446 2.579302
H  -0.459259 -0.298588 -1.197575
H  4.590732 -2.645023 -0.833582
H  3.234894 -3.378857 0.054018
H  4.759734 -3.035277 0.883349
H  0.415426 3.717619 1.878424
H  1.213589 4.300573 0.413255
H  1.532325 5.889814 2.283784
H  2.296153 4.643555 3.266052
H  3.088299 5.227648 1.792314
H  -5.252093 1.382298 -0.699599
H  -1.835322 2.695299 -3.302674
H  -0.945028 2.063552 -1.908125
H  -1.512562 0.958448 -3.191812
H  -6.934951 -1.453543 2.339758
H  -5.793833 -2.521545 1.499483
H  -5.22331 -1.462588 2.808047
H  -1.722202 -2.584163 1.087935
elementType: S O N C H
totalener: -1797.80457442 hartree
nucrepener: 3064.39761481 hartree
electener: -4862.20218923 hartree
oneelecener: -8558.09920639 hartree
twoeener: 3695.89701716 hartree
cpcmener: -0.03510892 hartree
kineticenergy: 1791.37608181 hartree
xcener: -147.481528211021 hartree
chargesum: 0.0000000
charge: 0.874113 -0.483089 -0.484169 -0.278733 -0.457313 -0.462098 -0.289808 -0.292141 0.188248 -0.196855 -0.316402 -0.137338 -0.423283 -0.426826 -0.104357 -0.072663 -0.059846 -0.155302 0.502194 0.372273 0.038196 0.369463 -0.252232 0.418773 0.414626 -0.326545 -0.130276 -0.115466 0.162918 0.225780 0.131625 0.127925 0.115045 0.100353 0.096278 0.090252 0.089352 0.089491 0.144890 0.138478 0.113734 0.113487 0.131555 0.113014 0.112935 0.189744
qa: 0.8741 -0.4831 -0.4842 -0.2787 -0.4573 -0.4621 -0.2898 -0.2921 0.1882 -0.1969 -0.3164 -0.1373 -0.4233 -0.4268 -0.1044 -0.0727 -0.0598 -0.1553 0.5022 0.3723 0.0382 0.3695 -0.2522 0.4188 0.4146 -0.3265 -0.1303 -0.1155 0.1629 0.2258 0.1316 0.1279 0.1150 0.1004 0.0963 0.0903 0.0894 0.0895 0.1449 0.1385 0.1137 0.1135 0.1316 0.1130 0.1129 0.1897
va: 5.8967 2.0187 2.0143 2.1501 2.0333 2.0534 2.1400 2.1305 3.3650 3.0906 2.8993 3.1833 2.9702 2.9677 4.0497 3.7182 4.0997 3.8507 4.0919 4.3999 3.8413 4.2482 3.9720 3.9956 4.0265 3.9326 3.8417 3.8499 1.0079 1.0487 0.9918 1.0012 1.0098 0.9965 0.9960 1.0065 1.0023 1.0030 1.0167 0.9952 1.0003 0.9936 0.9936 0.9957 0.9959 1.0189
dispcorr: -0.025001750 hartree
energy: -1797.829576169566
dipole: -4.09426 2.33121 -1.76306 13.73907 -12.49473 1.24433 9.42492 -7.78047 1.64445
magnitude: 2.71310 au
magnitude: 6.89616 debye
