program: Orca
programVersion: 4.2.1
elementType: S O O O O O O O N N N N N N C C C C C C C C C C C C C C H H H H H H H H H H H H H H H H H H
charge: 0
multiplicity: 1
keywords: wb97x-d3
keywords: def2-TZVPP
keywords: def2/J RIJCOSX GRIDX6 NOFINALGRIDX
keywords: grid4 nofinalgrid
keywords: scfconv7
keywords: smallprint printgap noloewdin
keywords: NOSOSCF
formula: C14H18N6O7S
InChI: InChI=1S/C14H18N6O7S/c1-5-27-12(21)8-7-15-20(2)11(8)28(23,24)19-14(22)18-13-16-9(25-3)6-10(17-13)26-4/h6-7,18-19H,5H2,1-4H3
46 atoms
S  1.774623 -0.9223 -1.465555
O  2.211696 -2.199565 -1.976617
O  1.800291 0.240081 -2.322193
O  2.183262 2.749237 1.391749
O  0.765987 1.762336 -0.029191
O  0.613997 -2.741089 0.508062
O  -3.030582 1.717346 -2.011297
O  -5.765871 -0.490707 1.017655
N  3.639851 -1.365628 0.523796
N  0.214544 -1.035331 -0.933089
N  4.214251 -0.803616 1.57663
N  -1.458995 -1.851072 0.451528
N  -2.217387 -0.044666 -0.803521
N  -3.608162 -1.174326 0.730208
C  2.694277 -0.566512 -0.002684
C  2.66235 0.590112 0.763959
C  3.644392 0.371602 1.736363
C  4.088164 -2.688226 0.124795
C  1.765774 1.742489 0.645985
C  -0.155136 -1.932216 0.035069
C  1.38487 3.945779 1.410721
C  -2.466272 -0.976539 0.099799
C  2.07835 4.944658 2.299952
C  -3.219842 0.774054 -1.109284
C  -4.59755 -0.348956 0.419795
C  -4.466869 0.671227 -0.514989
C  -1.754508 1.836375 -2.637296
C  -5.924127 -1.52805 1.981674
H  3.942649 1.018983 2.545664
H  -0.454012 -0.294812 -1.187977
H  4.584933 -2.657391 -0.840976
H  3.255585 -3.383251 0.092289
H  4.797322 -3.013264 0.878421
H  0.38653 3.71246 1.786591
H  1.282026 4.332075 0.394824
H  3.069818 5.198895 1.924329
H  1.489459 5.861479 2.330309
H  2.175243 4.577802 3.322091
H  -5.280527 1.337274 -0.762538
H  -1.85267 2.653043 -3.347694
H  -0.975852 2.085252 -1.917053
H  -1.484238 0.929735 -3.179951
H  -5.762593 -2.513871 1.545393
H  -5.252219 -1.396856 2.830104
H  -6.952571 -1.453577 2.325297
H  -1.711513 -2.525253 1.162521
elementType: S O N C H
totalener: -1797.80449253 hartree
nucrepener: 3063.55351192 hartree
electener: -4861.35800445 hartree
oneelecener: -8556.39834119 hartree
twoeener: 3695.04033673 hartree
cpcmener: -0.03509282 hartree
kineticenergy: 1791.37888095 hartree
xcener: -147.482165374313 hartree
chargesum: 0.0000000
charge: 0.874712 -0.482728 -0.484599 -0.277535 -0.457797 -0.460984 -0.290003 -0.292259 0.187582 -0.197659 -0.315910 -0.137013 -0.424557 -0.427251 -0.105185 -0.073519 -0.060235 -0.154660 0.503918 0.371145 0.038150 0.370129 -0.251843 0.417739 0.414229 -0.325598 -0.131529 -0.115596 0.163051 0.227671 0.131166 0.127434 0.115632 0.098873 0.096929 0.088955 0.090533 0.089078 0.144863 0.138384 0.116395 0.112389 0.112704 0.113442 0.131528 0.189830
qa: 0.8747 -0.4827 -0.4846 -0.2775 -0.4578 -0.4610 -0.2900 -0.2923 0.1876 -0.1977 -0.3159 -0.1370 -0.4246 -0.4273 -0.1052 -0.0735 -0.0602 -0.1547 0.5039 0.3711 0.0381 0.3701 -0.2518 0.4177 0.4142 -0.3256 -0.1315 -0.1156 0.1631 0.2277 0.1312 0.1274 0.1156 0.0989 0.0969 0.0890 0.0905 0.0891 0.1449 0.1384 0.1164 0.1124 0.1127 0.1134 0.1315 0.1898
va: 5.8957 2.0195 2.0130 2.1502 2.0341 2.0540 2.1395 2.1305 3.3667 3.0920 2.9000 3.1833 2.9698 2.9671 4.0568 3.7114 4.0996 3.8514 4.0916 4.3999 3.8414 4.2471 3.9720 3.9986 4.0269 3.9315 3.8408 3.8498 1.0080 1.0448 0.9922 1.0008 1.0098 0.9970 0.9959 1.0031 1.0065 1.0024 1.0167 0.9951 1.0010 0.9937 0.9958 0.9957 0.9936 1.0189
dispcorr: -0.024961538 hartree
energy: -1797.829454071170
dipole: -4.19949 2.44278 -1.75671 13.75262 -12.48929 1.26333 9.57682 -7.91307 1.66375
magnitude: 2.72949 au
magnitude: 6.93780 debye
