program: Orca
programVersion: 4.2.1
elementType: S O O O O O O O N N N N N N C C C C C C C C C C C C C C H H H H H H H H H H H H H H H H H H
charge: 0
multiplicity: 1
keywords: wb97x-d3
keywords: def2-TZVPP
keywords: def2/J RIJCOSX GRIDX6 NOFINALGRIDX
keywords: grid4 nofinalgrid
keywords: scfconv7
keywords: smallprint printgap noloewdin
keywords: NOSOSCF
formula: C14H18N6O7S
InChI: InChI=1S/C14H18N6O7S/c1-5-27-12(21)8-7-15-20(2)11(8)28(23,24)19-14(22)18-13-16-9(25-3)6-10(17-13)26-4/h6-7,18-19H,5H2,1-4H3
46 atoms
S  1.27005 -2.015013 0.840336
O  0.810069 -1.84971 2.198496
O  1.720689 -3.310782 0.39217
O  1.967062 2.5237 1.768888
O  0.363303 0.981925 1.538129
O  1.169686 -1.637388 -2.062104
O  -4.726676 1.622834 -2.845826
O  -3.737005 0.119974 1.432509
N  3.737634 -1.137511 -0.037849
N  0.020969 -1.49346 -0.109813
N  4.524675 -0.073379 -0.089947
N  -0.890747 -0.714544 -2.095314
N  -2.81115 0.440604 -2.474363
N  -2.306009 -0.307739 -0.296266
C  2.550546 -0.841838 0.521545
C  2.578853 0.505812 0.853868
C  3.849335 0.923009 0.441207
C  4.241597 -2.387919 -0.576242
C  1.511995 1.332352 1.422718
C  0.168927 -1.311872 -1.459567
C  1.028325 3.471005 2.306501
C  -2.053543 -0.174063 -1.586333
C  1.789714 4.724531 2.65226
C  -3.927335 0.98504 -2.011133
C  -3.432422 0.236195 0.154635
C  -4.305929 0.919191 -0.675152
C  -4.364382 1.700038 -4.221377
C  -2.856066 -0.598144 2.294474
H  4.284896 1.907663 0.502531
H  -0.808891 -1.078355 0.340759
H  5.20923 -2.16788 -1.014033
H  3.5798 -2.770265 -1.34654
H  4.366774 -3.129615 0.20753
H  0.548843 3.049091 3.191955
H  0.251765 3.675289 1.566352
H  2.264817 5.164692 1.775111
H  1.095606 5.460286 3.058604
H  2.554313 4.53674 3.406555
H  -5.218922 1.366234 -0.309706
H  -4.317456 0.712958 -4.682125
H  -5.149897 2.27997 -4.698885
H  -3.409456 2.206878 -4.36135
H  -2.71344 -1.627095 1.962271
H  -1.891313 -0.099959 2.386508
H  -3.341753 -0.608177 3.26666
H  -0.7615 -0.585018 -3.090444
elementType: S O N C H
totalener: -1797.80440946 hartree
nucrepener: 3075.56991290 hartree
electener: -4873.37432236 hartree
oneelecener: -8580.41469572 hartree
twoeener: 3707.04037336 hartree
cpcmener: -0.03549093 hartree
kineticenergy: 1791.37880698 hartree
xcener: -147.482290326277 hartree
chargesum: 0.0000000
charge: 0.876933 -0.482411 -0.483571 -0.278499 -0.457602 -0.462119 -0.291970 -0.289321 0.188746 -0.200761 -0.316508 -0.136809 -0.426113 -0.419587 -0.110014 -0.072015 -0.059815 -0.153689 0.507096 0.368807 0.037173 0.366649 -0.251974 0.414526 0.418593 -0.325835 -0.115851 -0.130752 0.162540 0.227025 0.115183 0.126219 0.131891 0.096289 0.099404 0.088696 0.090342 0.089714 0.145039 0.113886 0.131432 0.112157 0.114652 0.113971 0.138340 0.189914
qa: 0.8769 -0.4824 -0.4836 -0.2785 -0.4576 -0.4621 -0.2920 -0.2893 0.1887 -0.2008 -0.3165 -0.1368 -0.4261 -0.4196 -0.1100 -0.0720 -0.0598 -0.1537 0.5071 0.3688 0.0372 0.3666 -0.2520 0.4145 0.4186 -0.3258 -0.1159 -0.1308 0.1625 0.2270 0.1152 0.1262 0.1319 0.0963 0.0994 0.0887 0.0903 0.0897 0.1450 0.1139 0.1314 0.1122 0.1147 0.1140 0.1383 0.1899
va: 5.8937 2.0152 2.0182 2.1487 2.0304 2.0521 2.1302 2.1401 3.3662 3.0877 2.9002 3.1836 2.9676 2.9701 4.0636 3.7073 4.1014 3.8500 4.0891 4.4004 3.8424 4.2504 3.9717 4.0249 3.9954 3.9332 3.8501 3.8411 1.0082 1.0493 1.0098 1.0017 0.9921 0.9963 0.9963 1.0026 1.0067 1.0027 1.0164 0.9955 0.9936 0.9961 0.9922 1.0000 0.9957 1.0185
dispcorr: -0.025199539 hartree
energy: -1797.829608997675
dipole: -2.95455 1.67028 -1.28428 17.30587 -14.91520 2.39068 2.10178 -2.84602 -0.74424
magnitude: 2.81400 au
magnitude: 7.15262 debye
