program: Orca
programVersion: 4.2.1
elementType: S O O O O O O O N N N N N N C C C C C C C C C C C C C C H H H H H H H H H H H H H H H H H H
charge: 0
multiplicity: 1
keywords: wb97x-d3
keywords: def2-TZVPP
keywords: def2/J RIJCOSX GRIDX6 NOFINALGRIDX
keywords: grid4 nofinalgrid
keywords: scfconv7
keywords: smallprint printgap noloewdin
keywords: NOSOSCF
formula: C14H18N6O7S
InChI: InChI=1S/C14H18N6O7S/c1-5-27-12(21)8-7-15-20(2)11(8)28(23,24)19-14(22)18-13-16-9(25-3)6-10(17-13)26-4/h6-7,18-19H,5H2,1-4H3
46 atoms
S  1.780785 -0.908928 -1.472705
O  2.241953 -2.172948 -1.994396
O  1.803951 0.266051 -2.312037
O  2.101255 2.722524 1.448896
O  0.713449 1.739546 -0.004187
O  0.60363 -2.773918 0.455126
O  -3.017176 1.721467 -2.029769
O  -5.735818 -0.432498 1.052834
N  3.626243 -1.356016 0.535263
N  0.21379 -1.047853 -0.966028
N  4.179331 -0.801758 1.603542
N  -1.465599 -1.874475 0.405424
N  -2.214727 -0.054455 -0.835196
N  -3.598528 -1.160281 0.721871
C  2.675504 -0.56286 0.008604
C  2.617388 0.581397 0.792246
C  3.590482 0.362554 1.773679
C  4.099997 -2.664814 0.121363
C  1.705783 1.722462 0.682106
C  -0.160698 -1.955938 -0.010003
C  1.285239 3.906662 1.484676
C  -2.464203 -0.982597 0.07179
C  1.961957 4.900191 2.393306
C  -3.207226 0.782723 -1.123009
C  -4.5771 -0.314559 0.431312
C  -4.444652 0.703525 -0.505655
C  -1.753027 1.811935 -2.683849
C  -5.895155 -1.465963 2.020763
H  3.869154 1.002087 2.596156
H  -0.456267 -0.305871 -1.215149
H  4.611662 -2.610588 -0.835664
H  3.278639 -3.371337 0.063585
H  4.801745 -2.993078 0.880448
H  0.289393 3.652044 1.853479
H  1.17981 4.309015 0.475178
H  1.359764 5.807715 2.438637
H  2.062225 4.516687 3.409136
H  2.95047 5.175426 2.02454
H  -5.249688 1.385702 -0.737219
H  -0.954502 2.049759 -1.982154
H  -1.512121 0.897131 -3.226325
H  -1.850172 2.626652 -3.396654
H  -6.910266 -1.362371 2.395216
H  -5.775376 -2.455332 1.578904
H  -5.194678 -1.355839 2.848805
H  -1.720811 -2.552898 1.111513
elementType: S O N C H
totalener: -1797.80468261 hartree
nucrepener: 3066.59059124 hartree
electener: -4864.39527384 hartree
oneelecener: -8562.47651294 hartree
twoeener: 3698.08123910 hartree
cpcmener: -0.03539726 hartree
kineticenergy: 1791.37064381 hartree
xcener: -147.480651402292 hartree
chargesum: -0.0000000
charge: 0.875239 -0.482309 -0.484441 -0.278323 -0.459373 -0.460830 -0.289675 -0.292227 0.187818 -0.198204 -0.316306 -0.137513 -0.423422 -0.427020 -0.106550 -0.071537 -0.059842 -0.153715 0.505156 0.370476 0.038110 0.369045 -0.252434 0.418634 0.414949 -0.326591 -0.130508 -0.115264 0.162673 0.227241 0.131417 0.126789 0.115124 0.099518 0.096743 0.090686 0.089097 0.089143 0.144840 0.114384 0.113183 0.138528 0.131496 0.112907 0.113045 0.189843
qa: 0.8752 -0.4823 -0.4844 -0.2783 -0.4594 -0.4608 -0.2897 -0.2922 0.1878 -0.1982 -0.3163 -0.1375 -0.4234 -0.4270 -0.1065 -0.0715 -0.0598 -0.1537 0.5052 0.3705 0.0381 0.3690 -0.2524 0.4186 0.4149 -0.3266 -0.1305 -0.1153 0.1627 0.2272 0.1314 0.1268 0.1151 0.0995 0.0967 0.0907 0.0891 0.0891 0.1448 0.1144 0.1132 0.1385 0.1315 0.1129 0.1130 0.1898
va: 5.8955 2.0199 2.0131 2.1497 2.0310 2.0544 2.1398 2.1304 3.3661 3.0904 2.9003 3.1834 2.9689 2.9676 4.0570 3.7109 4.1004 3.8516 4.0899 4.4016 3.8412 4.2484 3.9722 3.9962 4.0263 3.9327 3.8414 3.8498 1.0081 1.0464 0.9921 1.0011 1.0100 0.9967 0.9961 1.0065 1.0024 1.0030 1.0167 1.0007 0.9934 0.9952 0.9936 0.9957 0.9959 1.0188
dispcorr: -0.025023071 hartree
energy: -1797.829705675727
dipole: -4.42112 2.64184 -1.77928 13.68243 -12.42582 1.25662 9.84904 -8.16555 1.68349
magnitude: 2.75301 au
magnitude: 6.99760 debye
