program: Gaussian 09
title: 000069134
version: EM64L-G09RevD.01
frameworkgroup: C1[X(C7H8N2O2)]
method: RPBEPBE
basis: SDD
operation: Freq
keyword: #pfreq=noraman
keyword: PBEPBE/SDD
title: #p freq=noraman PBEPBE/SDD
converged: YES YES NO NO
title: Mulliken charges:
elementType: O O N N C C C C C C C H H H H H H H H
charge: -0.450040 -0.335348 -0.694771 -0.696493 0.090409 0.377196 0.579395 -0.608019 -0.289672 -0.466183 0.132368 0.208256 0.266860 0.218960 0.296480 0.374425 0.311788 0.307067 0.377323
chargesum: 0.00000
title: Mulliken charges with hydrogens summed into heavy atoms:
elementType: O O N N C C C C C C C
charge: -0.072717 -0.335348 -0.023866 -0.077638 0.090409 0.377196 0.579395 -0.399763 -0.022812 -0.247223 0.132368
polarizability: 1.64295990e+02 4.74481016e+00 1.10597005e+02 -7.18614631e-03 1.04888728e-02 4.10037202e+01
1716.lowfreq: -9.8554 -7.7033 -0.0006 -0.0005 0.0003 5.9824 95.5369 105.3857 212.3088
frequency: 95.5361 105.3851 212.3087 217.3127 269.9138 332.9291 351.0059 397.1412 405.9145 411.0437 445.6965 454.9424 501.6204 551.9445 560.1562 576.9189 638.6505 677.9300 706.9512 725.4161 743.5245 778.0007 801.0171 842.3220 953.4875 967.4936 996.2076 1029.4842 1099.1781 1139.9883 1180.2261 1250.2011 1287.8863 1332.4512 1354.9467 1428.8106 1473.3207 1514.2538 1547.3879 1593.6866 1632.2905 1644.9349 1652.6809 3113.6040 3135.0822 3173.0555 3389.4245 3537.5759 3562.7074 3648.8620 3703.2002
redmass: 4.8750 9.7126 4.2197 5.5945 3.9165 3.1804 6.5857 1.1619 1.1035 5.4426 2.5426 1.1592 3.8918 1.1668 5.6913 5.2531 4.9543 2.9504 4.5763 1.5161 6.2722 1.4548 1.7826 2.3424 2.6322 1.3444 5.3895 1.5097 1.3879 1.3527 1.5163 2.0885 1.5761 3.4665 2.6457 7.3792 3.6416 3.6529 3.6240 3.8562 1.7793 1.2269 5.0952 1.0909 1.0892 1.0953 1.0575 1.0640 1.0450 1.0935 1.1040
irintensity: 3.6583 0.3236 8.2140 0.7060 1.2426 6.2237 4.5167 173.4105 137.3839 5.1065 13.9905 127.4934 5.4186 124.1335 34.6355 16.3989 0.3158 57.5576 2.1452 49.0565 0.1020 98.5959 7.9593 95.5141 26.8397 0.1100 246.1217 47.8078 6.7347 182.5625 70.4015 34.3973 22.5609 110.7252 61.1012 9.0961 117.1460 72.4413 148.8158 307.2933 68.3224 68.4017 746.9750 23.5414 12.0048 5.2247 120.0081 53.2347 91.4601 43.0243 22.3957
temp: 298.150 k
press: 1.00000 atm
elementType: 8 8 7 7 6 6 6 6 6 6 6 1 1 1 1 1 1 1 1
symmnumber: 1
zpe: 383678.3 jmol-1
zpe.correction: 0.146135 hartree
zpe.thermalcorrener: 0.156018 hartree
zpe.thermalcorrenthalpy: 0.156963 hartree
zpe.thermalcorrgfe: 0.111536 hartree
zpe.sumelectzpe: -530.733289 hartree
zpe.sumelectthermal: -530.723406 hartree
zpe.sumelectthermalent: -530.722462 hartree
zpe.sumelectthermalfe: -530.767888 hartree
dipole: -4.1990 0.6977 0.0056
dipole: 4.2566
quadrupole: -47.1598 -53.8044 -69.5548
quadrupole: -4.1845 0.0117 0.0243
quadrupole: 9.6798 3.0353 -12.7151 -4.1845 0.0117 0.0243
hfenergy: -530.8794247 hartree
pointgroup: C01 [X(C7H8N2O2)]
dipole: -1.6480666 -0.2962787 0.0245785 debye
dipolederiv: -0.703475 -0.4723554 -0.0124434 -0.8199589 -1.0747046 -0.0060205 -0.0259256 -0.0140198 -0.4325802 -1.2772743 0.2291112 0.0304014 0.4466661 -0.8096905 -0.0278305 0.0394419 -0.022914 -0.3727796 -0.5285996 0.4976025 0.0170904 0.4086728 -1.0890372 -0.0260377 0.0134997 -0.0281616 -0.6717045 -1.73368 0.0811857 0.0266925 -0.0804139 -0.1448289 0.0266695 0.0202232 0.0228873 -0.7297155 -1.377307 -0.2552735 0.0193099 0.2107096 -0.4510406 -0.0184618 0.0386262 -0.0074663 -0.1200714 0.9086672 -0.5644606 -0.0401864 -0.1550247 1.0995535 0.041293 -0.0240738 0.0514695 0.1790631 1.8336525 -0.124926 -0.0433784 0.1959735 0.5386496 0.009104 -0.0305163 0.0168172 0.198559 -0.7116859 0.4555432 0.0275774 0.4134783 -0.2131129 -0.0045282 0.0260366 -0.0054719 -0.3352586 0.7992793 -0.055029 -0.0222766 -0.446698 0.10209 0.0169155 -0.0377407 0.0077359 -0.0509858 -0.8000764 -0.0982911 0.0077478 -0.5082787 -0.1571405 0.0178452 -0.0094408 0.0079668 -0.2989658 2.4165928 0.2666131 -0.0412408 0.2675328 1.3276964 0.03718 -0.0418884 0.0373048 0.2235447 -0.0071146 -0.0709754 0.0014828 -0.0971662 -0.1050849 -0.0097526 0.0003916 -0.0104118 0.1853774 0.1033163 -0.0630379 -0.0015572 -0.04285 -0.0011288 -0.0051999 -0.0009999 -0.0047315 0.148032 -0.0270441 0.1078284 0.0093401 0.0892052 -0.0566961 -0.0119287 0.0085107 -0.0123484 0.1806053 0.1292931 -0.0725794 0.0025447 -0.0602346 0.1942277 -0.0059886 0.0031906 -0.0061448 0.3676833 0.3214586 0.0675399 0.003942 -0.0058383 0.296794 -0.0030842 0.0011771 -0.0049804 0.3699004 0.2378678 -0.0133935 0.0029044 -0.051198 0.1278153 -0.0096148 0.0016582 -0.0104947 0.3839039 0.2178991 0.0055011 0.0041947 0.0519101 0.1061779 -0.0129085 0.0059313 -0.0117954 0.3833421 0.1982301 0.0793969 0.0078547 0.1835131 0.3094608 -0.0076512 0.0118983 -0.0052409 0.3920503 unknown
polarizability: 164.3376955|-3.9516628|110.3630046|-3.0625678|2.9350722|41.1960158 unknown
InChI: InChI=1S/C7H8N2O2/c8-4-1-2-5(7(10)11)6(9)3-4/h1-3,10H,8-9H2
charge 0 multiplicity 1
19 atoms
O  2.630135 1.582071 -0.039145
O  2.905266 -0.715344 -0.1366
N  0.687299 -2.234822 -0.147594
N  -3.596705 0.080492 0.047689
C  0.649154 0.217931 -0.045883
C  -0.033418 -1.059806 -0.081792
C  -2.206552 0.114009 0.016294
C  -1.455198 -1.082875 -0.050334
C  -0.134086 1.408435 0.021349
C  -1.527268 1.378995 0.053073
C  2.102042 0.274872 -0.078131
H  -1.973478 -2.050118 -0.078459
H  0.396289 2.364618 0.048395
H  -2.105986 2.307975 0.105095
H  0.212569 -3.132975 -0.174702
H  1.712774 -2.165264 -0.169286
H  -4.133466 0.941524 0.096859
H  -4.101804 -0.800668 0.022375
H  3.620532 1.50195 -0.066199
