program: Orca
programVersion: 4.2.1
elementType: S O O O O O O O N N N N N N C C C C C C C C C C C C C C H H H H H H H H H H H H H H H H H H
charge: 0
multiplicity: 1
keywords: wb97x-d3
keywords: def2-TZVPP
keywords: def2/J RIJCOSX GRIDX6 NOFINALGRIDX
keywords: grid4 nofinalgrid
keywords: scfconv7
keywords: smallprint printgap noloewdin
keywords: NOSOSCF
formula: C14H18N6O7S
InChI: InChI=1S/C14H18N6O7S/c1-5-27-12(21)8-7-15-20(2)11(8)28(23,24)19-14(22)18-13-16-9(25-3)6-10(17-13)26-4/h6-7,18-19H,5H2,1-4H3
46 atoms
S  1.749152 -1.137341 1.459579
O  1.73504 -0.109355 2.473071
O  2.151976 -2.478845 1.809167
O  2.298054 2.873888 -0.889618
O  0.859622 1.741842 0.401615
O  0.684917 -2.654718 -0.804366
O  -3.016993 1.545204 2.044835
O  -5.526471 -0.030163 -1.527111
N  3.702909 -1.331067 -0.483678
N  0.218918 -1.154806 0.833763
N  4.323615 -0.644305 -1.430998
N  -1.36881 -1.719753 -0.761973
N  -2.170606 -0.074562 0.672938
N  -3.448115 -0.886294 -1.135777
C  2.744165 -0.594599 0.106635
C  2.753022 0.653044 -0.502587
C  3.771068 0.549641 -1.456917
C  4.120687 -2.70232 -0.249317
C  1.863026 1.792341 -0.265007
C  -0.098961 -1.897279 -0.273637
C  1.516251 4.077598 -0.792876
C  -2.36825 -0.849846 -0.378689
C  0.33495 4.073593 -1.73451
C  -3.156508 0.756905 0.996839
C  -4.420974 -0.048986 -0.805854
C  -4.33614 0.822655 0.27358
C  -1.817475 1.475302 2.813727
C  -5.64059 -0.919591 -2.634498
H  4.107099 1.292385 -2.162881
H  -0.45737 -0.443489 1.147478
H  4.865715 -2.930248 -1.003932
H  3.282858 -3.383342 -0.355884
H  4.566646 -2.812492 0.735117
H  2.213117 4.871589 -1.055606
H  1.202553 4.236723 0.239826
H  -0.15659 5.046171 -1.684804
H  0.648449 3.914002 -2.766545
H  -0.403426 3.316686 -1.472406
H  -5.136687 1.498781 0.536058
H  -1.959111 2.167794 3.639356
H  -1.653051 0.475883 3.218282
H  -0.950798 1.789389 2.233137
H  -4.867641 -0.737615 -3.381333
H  -5.597642 -1.962706 -2.32052
H  -6.614808 -0.718492 -3.072474
H  -1.581139 -2.278601 -1.578166
elementType: S O N C H
totalener: -1797.80283718 hartree
nucrepener: 3092.57697496 hartree
electener: -4890.37981214 hartree
oneelecener: -8614.36625835 hartree
twoeener: 3723.98644621 hartree
cpcmener: -0.03450847 hartree
kineticenergy: 1791.37702097 hartree
xcener: -147.482570747033 hartree
chargesum: 0.0000000
charge: 0.876207 -0.482309 -0.483920 -0.286057 -0.450812 -0.461848 -0.289785 -0.292288 0.188276 -0.200422 -0.317228 -0.137275 -0.420878 -0.426778 -0.110636 -0.082504 -0.061128 -0.154108 0.510618 0.371202 0.039346 0.367918 -0.256166 0.416646 0.414803 -0.325045 -0.131719 -0.115589 0.162733 0.228000 0.115295 0.127263 0.130926 0.111660 0.091323 0.096033 0.089601 0.089823 0.144671 0.138037 0.112416 0.116243 0.113119 0.113274 0.131394 0.189669
qa: 0.8762 -0.4823 -0.4839 -0.2861 -0.4508 -0.4618 -0.2898 -0.2923 0.1883 -0.2004 -0.3172 -0.1373 -0.4209 -0.4268 -0.1106 -0.0825 -0.0611 -0.1541 0.5106 0.3712 0.0393 0.3679 -0.2562 0.4166 0.4148 -0.3250 -0.1317 -0.1156 0.1627 0.2280 0.1153 0.1273 0.1309 0.1117 0.0913 0.0960 0.0896 0.0898 0.1447 0.1380 0.1124 0.1162 0.1131 0.1133 0.1314 0.1897
va: 5.8952 2.0152 2.0183 2.1451 2.0329 2.0527 2.1403 2.1298 3.3655 3.0899 2.8997 3.1837 2.9667 2.9667 4.0695 3.7025 4.1045 3.8507 4.0977 4.3985 3.8414 4.2487 3.9156 3.9928 4.0253 3.9315 3.8384 3.8496 1.0090 1.0459 1.0099 1.0013 0.9926 0.9956 1.0098 1.0068 1.0048 1.0120 1.0168 0.9954 0.9935 1.0023 0.9957 0.9958 0.9936 1.0189
dispcorr: -0.025694824 hartree
energy: -1797.828532002369
dipole: -7.82720 6.04554 -1.78165 12.68992 -11.19170 1.49821 -8.64988 7.01723 -1.63266
magnitude: 2.84332 au
magnitude: 7.22715 debye
