program: Orca
programVersion: 4.2.1
elementType: S O O O O O O O N N N N N N C C C C C C C C C C C C C C H H H H H H H H H H H H H H H H H H
charge: 0
multiplicity: 1
keywords: wb97x-d3
keywords: def2-TZVPP
keywords: def2/J RIJCOSX GRIDX6 NOFINALGRIDX
keywords: grid4 nofinalgrid
keywords: scfconv7
keywords: smallprint printgap noloewdin
keywords: NOSOSCF
formula: C14H18N6O7S
InChI: InChI=1S/C14H18N6O7S/c1-5-27-12(21)8-7-15-20(2)11(8)28(23,24)19-14(22)18-13-16-9(25-3)6-10(17-13)26-4/h6-7,18-19H,5H2,1-4H3
46 atoms
S  1.895399 -0.920408 -1.50111
O  2.363417 -2.182537 -2.02067
O  1.964558 0.262639 -2.325413
O  2.089432 2.65315 1.50524
O  0.800621 1.709303 -0.063945
O  0.63685 -2.81766 0.332429
O  -2.817108 1.900565 -1.982567
O  -5.536322 -0.155201 1.164342
N  3.650672 -1.41309 0.576094
N  0.307997 -1.051618 -1.05513
N  4.150516 -0.88772 1.684453
N  -1.397804 -1.843561 0.307098
N  -2.081667 0.043485 -0.86963
N  -3.467074 -1.008641 0.723403
C  2.731405 -0.602625 0.021303
C  2.63979 0.524051 0.827386
C  3.559969 0.276263 1.85151
C  4.136108 -2.716088 0.158014
C  1.740662 1.672257 0.689832
C  -0.098045 -1.963726 -0.114542
C  1.280764 3.842946 1.519081
C  -2.351523 -0.886154 0.029659
C  0.029581 3.676066 2.348975
C  -3.026929 0.952507 -1.09039
C  -4.399092 -0.094226 0.497043
C  -4.237558 0.939933 -0.417056
C  -1.585024 1.923434 -2.700805
C  -5.722889 -1.204668 2.109859
H  3.800524 0.894813 2.701465
H  -0.333354 -0.27726 -1.279026
H  3.317733 -3.423676 0.07614
H  4.822859 -3.050523 0.927908
H  4.6663 -2.651216 -0.78774
H  1.044135 4.144368 0.497827
H  1.928979 4.603508 1.950038
H  -0.492999 4.63253 2.393364
H  -0.65612 2.944578 1.922795
H  0.265788 3.380196 3.371406
H  -5.004597 1.679262 -0.596196
H  -1.665647 2.758005 -3.3921
H  -0.738418 2.093922 -2.037725
H  -1.432346 1.007195 -3.272172
H  -4.982151 -1.165581 2.908698
H  -6.711993 -1.046372 2.531673
H  -5.68827 -2.185982 1.636363
H  -1.671471 -2.52385 1.004006
elementType: S O N C H
totalener: -1797.80265264 hartree
nucrepener: 3101.78877304 hartree
electener: -4899.59142568 hartree
oneelecener: -8632.74579331 hartree
twoeener: 3733.15436763 hartree
cpcmener: -0.03426605 hartree
kineticenergy: 1791.39019521 hartree
xcener: -147.484644940956 hartree
chargesum: -0.0000000
charge: 0.877794 -0.481886 -0.484064 -0.287243 -0.448131 -0.459264 -0.289639 -0.292441 0.188339 -0.201668 -0.316797 -0.138496 -0.417151 -0.426189 -0.111677 -0.084020 -0.060345 -0.154851 0.509826 0.368496 0.044269 0.365774 -0.258115 0.415675 0.414851 -0.325540 -0.132893 -0.115427 0.162709 0.227124 0.128008 0.114857 0.131166 0.089818 0.111915 0.096558 0.090255 0.089346 0.144102 0.138497 0.114390 0.115002 0.112855 0.131440 0.113121 0.189650
qa: 0.8778 -0.4819 -0.4841 -0.2872 -0.4481 -0.4593 -0.2896 -0.2924 0.1883 -0.2017 -0.3168 -0.1385 -0.4172 -0.4262 -0.1117 -0.0840 -0.0603 -0.1549 0.5098 0.3685 0.0443 0.3658 -0.2581 0.4157 0.4149 -0.3255 -0.1329 -0.1154 0.1627 0.2271 0.1280 0.1149 0.1312 0.0898 0.1119 0.0966 0.0903 0.0893 0.1441 0.1385 0.1144 0.1150 0.1129 0.1314 0.1131 0.1896
va: 5.8947 2.0202 2.0133 2.1470 2.0356 2.0542 2.1391 2.1301 3.3665 3.0894 2.9001 3.1831 2.9640 2.9659 4.0641 3.7038 4.1048 3.8508 4.0989 4.4019 3.8375 4.2504 3.9182 3.9893 4.0249 3.9348 3.8375 3.8498 1.0088 1.0480 1.0004 1.0102 0.9925 1.0107 0.9955 1.0066 1.0108 1.0050 1.0170 0.9952 1.0025 0.9928 0.9959 0.9936 0.9956 1.0190
dispcorr: -0.025923205 hartree
energy: -1797.828575840341
dipole: -8.82442 6.90602 -1.91841 11.33549 -10.04454 1.29095 10.05957 -8.31755 1.74202
magnitude: 2.89508 au
magnitude: 7.35870 debye
