program: Orca
programVersion: 4.2.1
elementType: S O O O O O O O N N N N N N C C C C C C C C C C C C C C H H H H H H H H H H H H H H H H H H
charge: 0
multiplicity: 1
keywords: wb97x-d3
keywords: def2-TZVPP
keywords: def2/J RIJCOSX GRIDX6 NOFINALGRIDX
keywords: grid4 nofinalgrid
keywords: scfconv7
keywords: smallprint printgap noloewdin
keywords: NOSOSCF
formula: C14H18N6O7S
InChI: InChI=1S/C14H18N6O7S/c1-5-27-12(21)8-7-15-20(2)11(8)28(23,24)19-14(22)18-13-16-9(25-3)6-10(17-13)26-4/h6-7,18-19H,5H2,1-4H3
46 atoms
S  1.885062 -0.910265 -1.501499
O  2.339359 -2.177761 -2.020302
O  1.946658 0.263093 -2.339463
O  2.094311 2.644436 1.544317
O  0.845626 1.748826 -0.085531
O  0.655786 -2.766619 0.394112
O  -2.82788 1.869316 -2.019663
O  -5.553913 -0.15366 1.14414
N  3.664382 -1.403227 0.553715
N  0.306041 -1.03053 -1.025799
N  4.179804 -0.87958 1.655623
N  -1.389725 -1.814323 0.351559
N  -2.08493 0.043637 -0.862613
N  -3.471457 -0.9929 0.738797
C  2.743177 -0.588643 0.008503
C  2.663535 0.537663 0.81693
C  3.59469 0.285843 1.830634
C  4.130777 -2.712436 0.135413
C  1.766862 1.688754 0.689856
C  -0.08854 -1.929183 -0.068754
C  1.284198 3.832473 1.578573
C  -2.351666 -0.872069 0.051641
C  0.014525 3.636366 2.37367
C  -3.037335 0.937958 -1.10992
C  -4.411133 -0.092723 0.486315
C  -4.253339 0.92559 -0.446517
C  -1.593402 1.879249 -2.734083
C  -5.73921 -1.18906 2.10522
H  3.847588 0.902888 2.678159
H  -0.347774 -0.272168 -1.270348
H  4.655272 -2.656655 -0.814298
H  3.303032 -3.409979 0.061142
H  4.818941 -3.054374 0.900875
H  1.070694 4.168558 0.562589
H  1.921157 4.579257 2.04943
H  -0.506623 4.591942 2.447138
H  -0.663817 2.92491 1.903472
H  0.228723 3.297679 3.387977
H  -5.026459 1.653691 -0.645194
H  -1.671995 2.700052 -3.442222
H  -0.748179 2.063062 -2.072198
H  -1.439768 0.951843 -3.287301
H  -5.69918 -2.177253 1.646197
H  -5.001367 -1.135542 2.905953
H  -6.73044 -1.028503 2.521265
H  -1.658197 -2.483262 1.061414
elementType: S O N C H
totalener: -1797.80265610 hartree
nucrepener: 3101.12972426 hartree
electener: -4898.93238036 hartree
oneelecener: -8631.43150930 hartree
twoeener: 3732.49912894 hartree
cpcmener: -0.03440411 hartree
kineticenergy: 1791.38445394 hartree
xcener: -147.483898918653 hartree
chargesum: 0.0000000
charge: 0.876653 -0.482885 -0.481787 -0.286995 -0.449253 -0.460186 -0.289488 -0.292265 0.188737 -0.201784 -0.316699 -0.138405 -0.417466 -0.426238 -0.112332 -0.084288 -0.060816 -0.154683 0.512405 0.369377 0.041430 0.366010 -0.256933 0.415766 0.415361 -0.324809 -0.132079 -0.115346 0.162746 0.226825 0.131170 0.127582 0.114703 0.089589 0.111828 0.096714 0.089917 0.089177 0.144438 0.138571 0.114227 0.114348 0.113279 0.112687 0.131513 0.189689
qa: 0.8767 -0.4829 -0.4818 -0.2870 -0.4493 -0.4602 -0.2895 -0.2923 0.1887 -0.2018 -0.3167 -0.1384 -0.4175 -0.4262 -0.1123 -0.0843 -0.0608 -0.1547 0.5124 0.3694 0.0414 0.3660 -0.2569 0.4158 0.4154 -0.3248 -0.1321 -0.1153 0.1627 0.2268 0.1312 0.1276 0.1147 0.0896 0.1118 0.0967 0.0899 0.0892 0.1444 0.1386 0.1142 0.1143 0.1133 0.1127 0.1315 0.1897
va: 5.8962 2.0192 2.0159 2.1452 2.0341 2.0539 2.1400 2.1304 3.3664 3.0886 2.9006 3.1838 2.9648 2.9661 4.0678 3.6965 4.1055 3.8512 4.0981 4.4001 3.8412 4.2500 3.9169 3.9887 4.0247 3.9339 3.8382 3.8497 1.0089 1.0484 0.9924 1.0009 1.0102 1.0108 0.9955 1.0066 1.0110 1.0050 1.0169 0.9953 1.0017 0.9930 0.9955 0.9960 0.9936 1.0189
dispcorr: -0.025904129 hartree
energy: -1797.828560226485
dipole: -8.95117 6.99231 -1.95886 11.05987 -9.81899 1.24088 10.06882 -8.32677 1.74204
magnitude: 2.90028 au
magnitude: 7.37194 debye
