program: Orca
programVersion: 4.2.1
elementType: S O O O O O O O N N N N N N C C C C C C C C C C C C C C H H H H H H H H H H H H H H H H H H
charge: 0
multiplicity: 1
keywords: wb97x-d3
keywords: def2-TZVPP
keywords: def2/J RIJCOSX GRIDX6 NOFINALGRIDX
keywords: grid4 nofinalgrid
keywords: scfconv7
keywords: smallprint printgap noloewdin
keywords: NOSOSCF
formula: C14H18N6O7S
InChI: InChI=1S/C14H18N6O7S/c1-5-27-12(21)8-7-15-20(2)11(8)28(23,24)19-14(22)18-13-16-9(25-3)6-10(17-13)26-4/h6-7,18-19H,5H2,1-4H3
46 atoms
S  1.882389 -0.918122 -1.497927
O  2.328691 -2.192668 -2.008759
O  1.94354 0.251053 -2.343281
O  2.098379 2.641209 1.548834
O  0.854947 1.756698 -0.090826
O  0.653633 -2.752603 0.417731
O  -2.839063 1.857146 -2.039258
O  -5.564906 -0.148509 1.135946
N  3.676665 -1.398647 0.545483
N  0.304776 -1.028076 -1.015651
N  4.198961 -0.86896 1.641651
N  -1.389564 -1.794692 0.373826
N  -2.089722 0.047385 -0.861404
N  -3.477006 -0.981116 0.744768
C  2.750653 -0.587585 0.00294
C  2.674497 0.542283 0.806761
C  3.612792 0.296014 1.815374
C  4.145744 -2.709895 0.130834
C  1.775219 1.692614 0.685715
C  -0.090479 -1.917362 -0.049502
C  1.279905 3.823514 1.599946
C  -2.355258 -0.860882 0.060775
C  0.00843 3.606431 2.386383
C  -3.046861 0.93324 -1.121362
C  -4.420756 -0.089005 0.480468
C  -4.265287 0.920394 -0.462468
C  -1.600674 1.869638 -2.747409
C  -5.748244 -1.173846 2.108639
H  3.871004 0.917169 2.658216
H  -0.345395 -0.268879 -1.265362
H  4.669127 -2.655661 -0.819546
H  3.319272 -3.409439 0.060778
H  4.835498 -3.045991 0.897468
H  1.069233 4.175917 0.589257
H  1.910348 4.565233 2.087148
H  -0.517431 4.558123 2.474416
H  -0.66491 2.900645 1.901183
H  0.220244 3.251307 3.395322
H  -5.042179 1.64117 -0.672001
H  -1.436984 0.938597 -3.291386
H  -1.681624 2.683734 -3.462916
H  -0.760111 2.065656 -2.082761
H  -6.742185 -1.013941 2.518321
H  -5.700467 -2.167096 1.661817
H  -5.014225 -1.105836 2.911622
H  -1.655647 -2.458547 1.089581
elementType: S O N C H
totalener: -1797.80275741 hartree
nucrepener: 3099.75035288 hartree
electener: -4897.55311029 hartree
oneelecener: -8628.69720152 hartree
twoeener: 3731.14409123 hartree
cpcmener: -0.03465615 hartree
kineticenergy: 1791.37381919 hartree
xcener: -147.481822500418 hartree
chargesum: -0.0000000
charge: 0.877103 -0.482938 -0.483725 -0.286377 -0.449839 -0.459658 -0.289642 -0.292298 0.188440 -0.201335 -0.316374 -0.137953 -0.418375 -0.426403 -0.112245 -0.082619 -0.060911 -0.154089 0.510618 0.369055 0.041161 0.366524 -0.257053 0.415573 0.415137 -0.324525 -0.130517 -0.115441 0.162539 0.226635 0.131533 0.127035 0.114941 0.090143 0.111869 0.096781 0.089914 0.089545 0.144319 0.113993 0.138523 0.113366 0.131548 0.113356 0.112843 0.189820
qa: 0.8771 -0.4829 -0.4837 -0.2864 -0.4498 -0.4597 -0.2896 -0.2923 0.1884 -0.2013 -0.3164 -0.1380 -0.4184 -0.4264 -0.1122 -0.0826 -0.0609 -0.1541 0.5106 0.3691 0.0412 0.3665 -0.2571 0.4156 0.4151 -0.3245 -0.1305 -0.1154 0.1625 0.2266 0.1315 0.1270 0.1149 0.0901 0.1119 0.0968 0.0899 0.0895 0.1443 0.1140 0.1385 0.1134 0.1315 0.1134 0.1128 0.1898
va: 5.8936 2.0191 2.0129 2.1453 2.0333 2.0545 2.1401 2.1305 3.3666 3.0896 2.9010 3.1842 2.9635 2.9665 4.0701 3.6934 4.1061 3.8511 4.1014 4.4006 3.8409 4.2492 3.9166 3.9895 4.0256 3.9337 3.8390 3.8496 1.0091 1.0480 0.9923 1.0009 1.0101 1.0106 0.9956 1.0066 1.0111 1.0049 1.0169 0.9931 0.9954 1.0020 0.9936 0.9955 0.9959 1.0189
dispcorr: -0.025875583 hartree
energy: -1797.828632989231
dipole: -8.95758 7.00892 -1.94866 11.00791 -9.77008 1.23782 10.11360 -8.35466 1.75894
magnitude: 2.90230 au
magnitude: 7.37706 debye
