program: Orca
programVersion: 4.2.1
elementType: S O O O O O O O N N N N N N C C C C C C C C C C C C C C H H H H H H H H H H H H H H H H H H
charge: 0
multiplicity: 1
keywords: wb97x-d3
keywords: def2-TZVPP
keywords: def2/J RIJCOSX GRIDX6 NOFINALGRIDX
keywords: grid4 nofinalgrid
keywords: scfconv7
keywords: smallprint printgap noloewdin
keywords: NOSOSCF
formula: C14H18N6O7S
InChI: InChI=1S/C14H18N6O7S/c1-5-27-12(21)8-7-15-20(2)11(8)28(23,24)19-14(22)18-13-16-9(25-3)6-10(17-13)26-4/h6-7,18-19H,5H2,1-4H3
46 atoms
S  1.917921 -0.92415 -1.520969
O  2.383839 -2.193731 -2.02453
O  1.991772 0.245479 -2.363363
O  1.931612 2.558633 1.633918
O  0.829826 1.731545 -0.131732
O  0.662654 -2.79018 0.343037
O  -2.790871 1.879887 -2.058622
O  -5.464078 -0.033609 1.216372
N  3.678706 -1.390314 0.555598
N  0.330532 -1.045393 -1.070457
N  4.155006 -0.87172 1.677765
N  -1.367473 -1.805269 0.319644
N  -2.05449 0.053125 -0.898605
N  -3.416456 -0.929343 0.757429
C  2.744797 -0.593975 0.005124
C  2.613241 0.514152 0.832322
C  3.5294 0.270702 1.861936
C  4.193663 -2.678351 0.126045
C  1.694324 1.64741 0.704616
C  -0.072578 -1.941009 -0.112949
C  1.085007 3.720208 1.679596
C  -2.315255 -0.843921 0.035595
C  -0.229058 3.442342 2.371515
C  -2.99281 0.966885 -1.128799
C  -4.341456 -0.009595 0.522445
C  -4.187399 0.993128 -0.427732
C  -1.583774 1.846801 -2.817723
C  -5.645751 -1.052824 2.195503
H  3.746169 0.879697 2.725085
H  -0.316104 -0.282083 -1.317092
H  3.391575 -3.404432 0.040381
H  4.889368 -3.002909 0.892203
H  4.721067 -2.594101 -0.819803
H  0.930956 4.11126 0.672892
H  1.664554 4.454157 2.236953
H  -0.784983 4.376537 2.461697
H  -0.850369 2.740693 1.81562
H  -0.074221 3.051036 3.377486
H  -4.949021 1.736453 -0.61334
H  -0.710897 2.029278 -2.192007
H  -1.468999 0.903199 -3.352494
H  -1.672151 2.651937 -3.542484
H  -6.617757 -0.85997 2.641955
H  -5.648237 -2.046657 1.747309
H  -4.88048 -1.010879 2.970648
H  -1.636774 -2.467753 1.035483
elementType: S O N C H
totalener: -1797.80254509 hartree
nucrepener: 3110.56053478 hartree
electener: -4908.36307988 hartree
oneelecener: -8650.26784086 hartree
twoeener: 3741.90476099 hartree
cpcmener: -0.03494058 hartree
kineticenergy: 1791.37731104 hartree
xcener: -147.482436726903 hartree
chargesum: 0.0000000
charge: 0.878326 -0.481717 -0.482354 -0.286478 -0.450142 -0.458406 -0.288986 -0.292277 0.188067 -0.204223 -0.316306 -0.138501 -0.415911 -0.425243 -0.114331 -0.081933 -0.060383 -0.153823 0.511868 0.367347 0.041734 0.363013 -0.254789 0.414034 0.415040 -0.323220 -0.131344 -0.115369 0.162350 0.227252 0.127102 0.114881 0.131347 0.089739 0.111425 0.097032 0.086715 0.089636 0.144134 0.113003 0.115515 0.138604 0.131407 0.113528 0.112717 0.189921
qa: 0.8783 -0.4817 -0.4824 -0.2865 -0.4501 -0.4584 -0.2890 -0.2923 0.1881 -0.2042 -0.3163 -0.1385 -0.4159 -0.4252 -0.1143 -0.0819 -0.0604 -0.1538 0.5119 0.3673 0.0417 0.3630 -0.2548 0.4140 0.4150 -0.3232 -0.1313 -0.1154 0.1623 0.2273 0.1271 0.1149 0.1313 0.0897 0.1114 0.0970 0.0867 0.0896 0.1441 0.1130 0.1155 0.1386 0.1314 0.1135 0.1127 0.1899
va: 5.8932 2.0204 2.0136 2.1451 2.0337 2.0546 2.1392 2.1305 3.3680 3.0873 2.9013 3.1846 2.9603 2.9645 4.0753 3.6833 4.1067 3.8512 4.1020 4.4025 3.8418 4.2518 3.9190 3.9877 4.0238 3.9354 3.8390 3.8496 1.0093 1.0476 1.0004 1.0103 0.9925 1.0111 0.9958 1.0069 1.0098 1.0052 1.0170 1.0010 0.9924 0.9954 0.9937 0.9955 0.9959 1.0188
dispcorr: -0.026174464 hartree
energy: -1797.828719558182
dipole: -9.53379 7.53227 -2.00153 10.76142 -9.52337 1.23805 10.23954 -8.44461 1.79493
magnitude: 2.95984 au
magnitude: 7.52332 debye
