program: Orca
programVersion: 4.2.1
elementType: S O O O O O O O N N N N N N C C C C C C C C C C C C C C H H H H H H H H H H H H H H H H H H
charge: 0
multiplicity: 1
keywords: wb97x-d3
keywords: def2-TZVPP
keywords: def2/J RIJCOSX GRIDX6 NOFINALGRIDX
keywords: grid4 nofinalgrid
keywords: scfconv7
keywords: smallprint printgap noloewdin
keywords: NOSOSCF
formula: C14H18N6O7S
InChI: InChI=1S/C14H18N6O7S/c1-5-27-12(21)8-7-15-20(2)11(8)28(23,24)19-14(22)18-13-16-9(25-3)6-10(17-13)26-4/h6-7,18-19H,5H2,1-4H3
46 atoms
S  1.855499 -0.971364 1.545538
O  1.872794 0.215603 2.367541
O  2.392312 -2.206841 2.063596
O  1.708624 2.506557 -1.60581
O  0.589705 1.581683 0.098032
O  0.682748 -2.907699 -0.307165
O  -2.875147 1.753842 1.940906
O  -5.297978 -0.025495 -1.592892
N  3.631608 -1.363899 -0.534046
N  0.271986 -1.183626 1.112412
N  4.089924 -0.820054 -1.651757
N  -1.361325 -1.949879 -0.350172
N  -2.106352 -0.094911 0.837183
N  -3.338519 -1.005773 -0.955476
C  2.658831 -0.613171 0.013262
C  2.481543 0.491195 -0.810201
C  3.414256 0.293997 -1.834702
C  4.204915 -2.627033 -0.102721
C  1.494801 1.568349 -0.698127
C  -0.081907 -2.074862 0.130351
C  0.78367 3.60587 -1.677481
C  -2.307342 -0.968098 -0.133415
C  1.039579 4.649313 -0.615736
C  -3.023146 0.856031 0.986256
C  -4.245868 -0.053109 -0.795891
C  -4.143759 0.935029 0.17602
C  -1.749125 1.669263 2.811847
C  -5.417241 -1.016192 -2.609757
H  3.607124 0.915168 -2.694793
H  -0.399613 -0.433035 1.333688
H  4.73097 -2.516144 0.84126
H  4.912568 -2.922364 -0.869949
H  3.435792 -3.387767 -0.01263
H  -0.241237 3.233832 -1.630509
H  0.941865 4.024055 -2.670209
H  0.826119 4.283113 0.387295
H  2.069858 5.004879 -0.646719
H  0.388773 5.504954 -0.801528
H  -4.889475 1.706982 0.296713
H  -1.714511 0.714451 3.337392
H  -0.814328 1.832681 2.276707
H  -1.881872 2.465721 3.539417
H  -4.580444 -0.982279 -3.307424
H  -5.494003 -2.019405 -2.190298
H  -6.335145 -0.780585 -3.141827
H  -1.591355 -2.604199 -1.087145
elementType: S O N C H
totalener: -1797.80137581 hartree
nucrepener: 3114.25000408 hartree
electener: -4912.05137989 hartree
oneelecener: -8657.67487326 hartree
twoeener: 3745.62349337 hartree
cpcmener: -0.03417567 hartree
kineticenergy: 1791.37837814 hartree
xcener: -147.481864011637 hartree
chargesum: -0.0000000
charge: 0.881770 -0.482952 -0.482733 -0.287362 -0.443158 -0.455552 -0.289106 -0.292596 0.188572 -0.204901 -0.317038 -0.140480 -0.412754 -0.423308 -0.117676 -0.077904 -0.060963 -0.153036 0.503429 0.362247 0.048273 0.359663 -0.262260 0.421263 0.415851 -0.328294 -0.126718 -0.114310 0.162685 0.224246 0.130861 0.115000 0.127209 0.089199 0.110426 0.092748 0.088428 0.096812 0.143808 0.118340 0.106383 0.139103 0.112551 0.113115 0.130761 0.190360
qa: 0.8818 -0.4830 -0.4827 -0.2874 -0.4432 -0.4556 -0.2891 -0.2926 0.1886 -0.2049 -0.3170 -0.1405 -0.4128 -0.4233 -0.1177 -0.0779 -0.0610 -0.1530 0.5034 0.3622 0.0483 0.3597 -0.2623 0.4213 0.4159 -0.3283 -0.1267 -0.1143 0.1627 0.2242 0.1309 0.1150 0.1272 0.0892 0.1104 0.0927 0.0884 0.0968 0.1438 0.1183 0.1064 0.1391 0.1126 0.1131 0.1308 0.1904
va: 5.8899 2.0143 2.0191 2.1442 2.0420 2.0563 2.1375 2.1294 3.3663 3.0835 2.9005 3.1823 2.9654 2.9668 4.0708 3.6874 4.1062 3.8503 4.1130 4.4075 3.8383 4.2576 3.9151 3.9867 4.0223 3.9384 3.8429 3.8497 1.0088 1.0551 0.9929 1.0100 1.0007 1.0103 0.9958 1.0108 1.0055 1.0058 1.0170 0.9919 0.9974 0.9951 0.9960 0.9955 0.9939 1.0183
dispcorr: -0.026224552 hartree
energy: -1797.827600364789
dipole: -6.46904 4.52185 -1.94719 13.65143 -12.34825 1.30318 -6.87307 5.07857 -1.79450
magnitude: 2.95128 au
magnitude: 7.50156 debye
